コンパイルエラー

コンパイルのフェーズで生成されるエラーです。よく無効なシンタックスやタイプが含まれているとき発生します。

RSS
  • 解決済

    回答
    3

    コマンドでのコンパイル

    前提・実現したいこと eclipseではコンパイル可能で実行可能でしたが、自分でWindowsのコマンドプロンプトでコンパイルしようとするとエラーとなってしまいます。。 また、1ファイルの場合では自分でコマンドプロンプトでのコンパイルから実行まで可能できました。複数クラス(複数ファイル)になるとコンパイルエラーとなってしまいます。 発生している問題・

    • 0評価
    • 252PV
    nterka nterka 4ヶ月前に ベストアンサー
  • 解決済

    回答
    1

    return文が指定されていません

    public class Main { public static void main(String[] args) { Scanner sc = new Scanner(System.in); String E = sc.nextLine(); int a = keisan(E) ;

    • 0評価
    • 312PV
    sankakusan sankakusan 4ヶ月前に ベストアンサー
  • 解決済

    回答
    1

    error: missing return statement というコンパイルエラーについて

    public class Main { public static void main(String[] args) { Scanner sc = new Scanner(System.in); int n = sc.nextInt(); System.out.println(cul(n));

    • 0評価
    • 350PV
    sankakusan sankakusan 4ヶ月前に コメント
  • 解決済

    回答
    3

    C言語 initilizer element is not constant

    gcc を使っていてinitilizer element is not constantというエラーが出ました。 #include <stdlib.h> #include <stdio.h> #include <math.h> #include <string.h> #define pi 3.141592653589793 #define c 2.99

    • 0評価
    • 334PV
    simasimaa simasimaa 5ヶ月前に ベストアンサー
  • 解決済

    回答
    1

    arduinoのスケッチでコンパイルエラー

    基本的なところなのですが、スケッチの例でArduinoISPがコンパイルで きなくなってしまいました。 全体の環境構築が初めてだったので、以前も苦労して構築したのですが、 Windows10のCreators Updateが走ってしまい、元に戻したのですが、 動かなくなってしまいました。 エラーメッセージ 、 D:\arduino-1.6.9\hardw

    • 0評価
    • 493PV
    masayuki_n masayuki_n 6ヶ月前に コメント
  • 解決済

    回答
    2

    javacのsymbolエラー

    ディレクトリ構造 /home/r207/Dropbox/compile compileディレクトリ内に,Javaファイルあり.ここでコンパイルする. 存在するファイルA.java, B.java B.javaはA.javaに依存 質問 javacでB.javaをコンパイルしようとすると「cannot find symbol」というエラーが出ます.(OSは

    • 0評価
    • 288PV
    Matt Matt 8ヶ月前に コメント
  • 解決済

    回答
    2

    Eclipseで @WebServlet("サーブレット名")を利用したいです。

    Eclipseで @WebServlet("サーブレット名")を利用したいです。 jspファイル内で action="サーブレット名" を指定してサーブレットに情報を送信して利用したいです。 サーブレットには@WebSerblet("サーブレット名")を書いています。 ですが、以下のコンパイルエラーが出ており、利用できません。 WebServle

    • 0評価
    • 432PV
    llemon llemon 8ヶ月前に コメント
  • 解決済

    回答
    4

    C言語 エラーメッセージがよくわからない所を指摘してきます

    C言語の初心者です 最近プログラミングの勉強を始めた者です。 質問するのが初めてなので、かなりおかしな所があると思います。すみません 今、関数のreturn文を使って点数の評価を求めるプログラムを書きましたが、 コンパイルエラーの意味が分かりません。(エラー文の日本語自体はわかります) どういうことかというと、return最後に記述し、値を戻し

    • 0評価
    • 398PV
    KSwordOfHaste KSwordOfHaste 9ヶ月前に コメント
  • 解決済

    回答
    1

    C# Inputを使うには

    これはInput.locationを使って位置情報を調べるテストコードですが、Inputがどうやら使えないようで、Inputを使うための何か別のライブラリが必要なのでしょうか? using System; using System.Collections.Generic; using System.Linq; using System.Threadin

    • 0評価
    • 337PV
    JectABC JectABC 9ヶ月前に ベストアンサー
  • 解決済

    回答
    1

    GlupでSCSSのコンパイルと終了ができない

    Gulpを利用してサイトを作成しているのですが、急にSCSSのコンパイルなどができなくなりました。 MacなのでTimeMachineを使って、問題が起きる前まで復元してみたのですが 解決できなかったため、どなたかご教示いだければと思います。 問題としては 1)SCSSがコンパイルされない 2)ターミナルでcontrol+cで終了もできない

    • 0評価
    • 665PV
    Kama Kama 1年以上前に コメント
  • 受付中

    回答
    2

    【コンパイルエラー】Sassがコンパイル出来ず困っております。

    Sass初心者のものですが、コンパイルが出来なくなり右往左往しております。 皆様のお力をお借りしたく、何卒よろしくお願いいたします。 状況と致しましては、昨日までは問題なくコンパイルできていたのですが、先ほど、編集の続きをしようと思い、コンパイルしようとすると下記のエラーが出てコンパイルされなくなりました。 Too many open filesと

    • -1評価
    • 1427PV
    rdlabo rdlabo 1年以上前に 回答
  • 解決済

    回答
    1

    【go言語】以前まで動いていたプログラムがコンパイルできなくなった

    概要 私はgo言語を用いてあるアプリケーションの作成を行っています。 そのアプリケーションはmacOS ElCapitanで作成、コンパイル、実行を行いました。 しかし、つい先日、macOSをsierraにアップグレードしてから様子がおかしいです。 このプログラムが急にコンパイルできなくなりました。 原因は不明ですが、macOSのアップグレードが怪

    • 0評価
    • 577PV
    emusute1212 emusute1212 1年以上前に 回答
  • 解決済

    回答
    1

    MSYSでmake機能が使えないので使えるようになりたい

    MSYSを用いてプログラムをインストールをするためにコンパイルを行うのですが、makeを打ち込むと bash: make: コマンドが見つかりません と、なりインストールすることができません。 解決方法をご教授いただけるとありがたいです。 環境ですが、MSYSとMinGWを使用しており、この2つの連携は失敗していないはずです。 宜しく

    • 0評価
    • 482PV
    marionetter8 marionetter8 1年以上前に ベストアンサー
  • 解決済

    回答
    1

    C++ のexpected initializer before *** のエラーについて

    以下のようなエラー文がでていて原因を調べても解決できていない状態なのでアドバイス頂きたいです。 src/***.cpp: In member function ‘関数名’: src/***.cpp:26: error: expected initializer before -- make: *** [obj/***.o] Error 1 状況として

    • 0評価
    • 4817PV
    kkkmokotan kkkmokotan 1年以上前に 回答
  • 解決済

    回答
    3

    java コンパイルエラーの対応

    javaコンパイルエラーの対応 発生している問題・エラーメッセージ エラーメッセージ class、interfaceまたはenumがありません <identifier>がありません class、interfaceまたはenumがありません 該当のソースコード public class main { public static void

    • 0評価
    • 914PV
    Mr_Roboto Mr_Roboto 1年以上前に コメント
  • 解決済

    回答
    1

    macでx11/xlib.hの参照

    環境 mac ElCapitan 現在gccを使ってコンパイルをしようとしているファイルに #include <X11/Xlib.h> とあります。 これをコンパイルしようとするとエラーで ./deconv.h:15:10: fatal error: 'X11/Xlib.h' file not found ,#include <X1

    • 0評価
    • 1762PV
    hikatyu1029 hikatyu1029 1年以上前に コメント
  • 解決済

    回答
    2

    C言語: コンパイルエラーの原因がわかりません・・・

    C言語でデータベースを作ろうと思い、 main() first() signin() register() から構成されるプログラムを実装中です。main()first()signin()を実装したまでは良かったのですが、register()を実装した後、コンパイルすると error: expected identifier or '(' vo

    • 0評価
    • 441PV
    TakeshiYamada TakeshiYamada 1年以上前に コメント
  • 解決済

    回答
    2

    java コンパイルエラーについて

    初投稿ですjavaを勉強しはじめて一週間程度です 発生している問題・エラーメッセージ elseへのifがありませんというエラーへの対処法 該当のソースコード class Greeting { public static void main(String[] args){ int time =8; if((time>=4)&&(time<=

    • 0評価
    • 777PV
    hati_loku hati_loku 1年以上前に コメント
  • 解決済

    回答
    1

    静的リンク(-static)をつけてのコンパイルのエラーについて

    ubuntuでopenmpiを使い並列計算用のコード(hogehoge.cpp)を、静的ライブラリオプション-staticをつけてコンパイルしたいと思っています。 staticオプションなしではコンパイルは通ります. しかし,以下のように-staticをつけ、 mpicxx \ -static -Ofast -fopenmp -std=c++1

    • 0評価
    • 3274PV
    ahill ahill 1年以上前に ベストアンサー
  • 解決済

    回答
    1

    線形リストを用いたスタックのコンパイルエラーを解決したいです。

    前提・実現したいこと 演算子、および括弧(左括弧「(」と右括弧「)」) のトークンで構成された中置記法の算術式を読み込み、 スタックを用いて逆ポーランド記法の式を出力する Cのプログラムを作成する。 エラーの理由だけでも教えていただければ、幸いです。 発生している問題・エラーメッセージ エラーメッセージ gcc revp.c revp.c

    • 0評価
    • 833PV
    awellbottom awellbottom 1年以上前に ベストアンサー
1

タグ情報

  • あなたの順位

    -

  • タグ登録者数

    12

  • 総質問数

    26

  • 今週の質問数

    0

関連するタグ

コンパイルエラータグのよく見られている質問

思考するエンジニアのためのQ&Aサイト「teratail」について詳しく知る