質問をすることでしか得られない、回答やアドバイスがある。

15分調べてもわからないことは、質問しよう!

ただいまの
回答率

88.91%

Unityでビルドができない

解決済

回答 1

投稿 編集

  • 評価
  • クリップ 0
  • VIEW 330

NEKO_2525

score 26

環境

ソフト名 バージョン
Windows 10(insiderPreview) 64bit
Unity 2020.1.0b3(64bit)
JDK OpenJDK(Unity付属

実現したいこと

UnityでAndroidゲームを作っているのですが、以下記載のエラーが2つのプロジェクトで発生し、ビルドが全くできません。
ビルドすると、エラーの詳しい内容はコンソールをみてね的な内容が出てきて、コンソールを見ると、以下の内容が表示されましたが、全く分からず、ビルド出来ません。
原因などを教えてください。

試したこと

さっぱりわからないので何も試してません

エラー

多すぎてイライラします

* What went wrong:

UnityEngine.GUIUtility:ProcessEvent(Int32, IntPtr, Boolean&)
A problem occurred evaluating project ':launcher'.

UnityEngine.GUIUtility:ProcessEvent(Int32, IntPtr, Boolean&)
> Failed to apply plugin [id 'com.android.application']

UnityEngine.GUIUtility:ProcessEvent(Int32, IntPtr, Boolean&)
   > Your project path contains non-ASCII characters. This will most likely cause the build to fail on Windows. Please move your project to a different directory. See http://b.android.com/95744 for details. This warning can be disabled by adding the line 'android.overridePathCheck=true' to gradle.properties file in the project directory.

UnityEngine.GUIUtility:ProcessEvent(Int32, IntPtr, Boolean&)
Run with --stacktrace option to get the stack trace. Run with --info or --debug option to get more log output. Run with --scan to get full insights.

UnityEngine.GUIUtility:ProcessEvent(Int32, IntPtr, Boolean&)
Picked up JAVA_TOOL_OPTIONS: -Dfile.encoding=UTF-8

UnityEngine.GUIUtility:ProcessEvent(Int32, IntPtr, Boolean&)
CommandInvokationFailure: Gradle build failed. 
C:/Program Files/2020.1.0b3/Editor/Data/PlaybackEngines/AndroidPlayer\OpenJDK\bin\java.exe -classpath "C:\Program Files\2020.1.0b3\Editor\Data\PlaybackEngines\AndroidPlayer\Tools\gradle\lib\gradle-launcher-5.1.1.jar" org.gradle.launcher.GradleMain "-Dorg.gradle.jvmargs=-Xmx4096m" "assembleRelease"

stderr[

FAILURE: Build failed with an exception.

* Where:
Build file 'C:\Users\takut\OneDrive\プログラミング\Unity\SwipeGo\Temp\gradleOut\launcher\build.gradle' line: 3

* What went wrong:
A problem occurred evaluating project ':launcher'.
> Failed to apply plugin [id 'com.android.application']
   > Your project path contains non-ASCII characters. This will most likely cause the build to fail on Windows. Please move your project to a different directory. See http://b.android.com/95744 for details. This warning can be disabled by adding the line 'android.overridePathCheck=true' to gradle.properties file in the project directory.

* Try:
Run with --stacktrace option to get the stack trace. Run with --info or --debug option to get more log output. Run with --scan to get full insights.

* Get more help at https://help.gradle.org

BUILD FAILED in 4s
Picked up JAVA_TOOL_OPTIONS: -Dfile.encoding=UTF-8
]
stdout[

]
exit code: 1
UnityEditor.Android.Command.WaitForProgramToRun (UnityEditor.Utils.Program p, UnityEditor.Android.Command+WaitingForProcessToExit waitingForProcessToExit, System.String errorMsg) (at <698408df9428411abcdde21f232e896c>:0)
UnityEditor.Android.Command.Run (System.Diagnostics.ProcessStartInfo psi, UnityEditor.Android.Command+WaitingForProcessToExit waitingForProcessToExit, System.String errorMsg) (at <698408df9428411abcdde21f232e896c>:0)
UnityEditor.Android.Command.Run (System.String command, System.String args, System.String workingdir, UnityEditor.Android.Command+WaitingForProcessToExit waitingForProcessToExit, System.String errorMsg) (at <698408df9428411abcdde21f232e896c>:0)
UnityEditor.Android.AndroidJavaTools.RunJava (System.String args, System.String workingdir, System.Action`1[T] progress, System.String error) (at <698408df9428411abcdde21f232e896c>:0)
UnityEditor.Android.GradleWrapper.Run (UnityEditor.Android.AndroidJavaTools javaTools, System.String workingdir, System.String task, System.Action`1[T] progress) (at <698408df9428411abcdde21f232e896c>:0)
Rethrow as GradleInvokationException: Gradle build failed
UnityEditor.Android.GradleWrapper.Run (UnityEditor.Android.AndroidJavaTools javaTools, System.String workingdir, System.String task, System.Action`1[T] progress) (at <698408df9428411abcdde21f232e896c>:0)
UnityEditor.Android.PostProcessor.Tasks.BuildGradleProject.Execute (UnityEditor.Android.PostProcessor.PostProcessorContext context) (at <698408df9428411abcdde21f232e896c>:0)
UnityEditor.Android.PostProcessor.PostProcessRunner.RunAllTasks (UnityEditor.Android.PostProcessor.PostProcessorContext context) (at <698408df9428411abcdde21f232e896c>:0)
Rethrow as BuildFailedException: Exception of type 'UnityEditor.Build.BuildFailedException' was thrown.
UnityEditor.Android.PostProcessor.CancelPostProcess.AbortBuild (System.String title, System.String message, System.Exception ex) (at <698408df9428411abcdde21f232e896c>:0)
UnityEditor.Android.PostProcessor.PostProcessRunner.RunAllTasks (UnityEditor.Android.PostProcessor.PostProcessorContext context) (at <698408df9428411abcdde21f232e896c>:0)
UnityEditor.Android.PostProcessAndroidPlayer.PostProcess (UnityEditor.BuildTarget target, System.String stagingAreaData, System.String stagingArea, System.String playerPackage, System.String installPath, System.String companyName, System.String productName, UnityEditor.BuildOptions options, UnityEditor.RuntimeClassRegistry usedClassRegistry, UnityEditor.Build.Reporting.BuildReport report) (at <698408df9428411abcdde21f232e896c>:0)
UnityEditor.Android.AndroidBuildPostprocessor.PostProcess (UnityEditor.Modules.BuildPostProcessArgs args, UnityEditor.BuildProperties& outProperties) (at <698408df9428411abcdde21f232e896c>:0)
UnityEditor.PostprocessBuildPlayer.Postprocess (UnityEditor.BuildTargetGroup targetGroup, UnityEditor.BuildTarget target, System.String installPath, System.String companyName, System.String productName, System.Int32 width, System.Int32 height, UnityEditor.BuildOptions options, UnityEditor.RuntimeClassRegistry usedClassRegistry, UnityEditor.Build.Reporting.BuildReport report) (at <e2353c5c084f4b5a9d8ead9c6b8ffaa2>:0)
UnityEngine.GUIUtility:ProcessEvent(Int32, IntPtr, Boolean&)
Build completed with a result of 'Failed'
UnityEngine.GUIUtility:ProcessEvent(Int32, IntPtr, Boolean&)
UnityEditor.BuildPlayerWindow+BuildMethodException: 20 errors
  at UnityEditor.BuildPlayerWindow+DefaultBuildMethods.BuildPlayer (UnityEditor.BuildPlayerOptions options) [0x0027c] in <e2353c5c084f4b5a9d8ead9c6b8ffaa2>:0 
  at UnityEditor.BuildPlayerWindow.CallBuildMethods (System.Boolean askForBuildLocation, UnityEditor.BuildOptions defaultBuildOptions) [0x00080] in <e2353c5c084f4b5a9d8ead9c6b8ffaa2>:0 
UnityEngine.GUIUtility:ProcessEvent(Int32, IntPtr, Boolean&)
  • 気になる質問をクリップする

    クリップした質問は、後からいつでもマイページで確認できます。

    またクリップした質問に回答があった際、通知やメールを受け取ることができます。

    クリップを取り消します

  • 良い質問の評価を上げる

    以下のような質問は評価を上げましょう

    • 質問内容が明確
    • 自分も答えを知りたい
    • 質問者以外のユーザにも役立つ

    評価が高い質問は、TOPページの「注目」タブのフィードに表示されやすくなります。

    質問の評価を上げたことを取り消します

  • 評価を下げられる数の上限に達しました

    評価を下げることができません

    • 1日5回まで評価を下げられます
    • 1日に1ユーザに対して2回まで評価を下げられます

    質問の評価を下げる

    teratailでは下記のような質問を「具体的に困っていることがない質問」、「サイトポリシーに違反する質問」と定義し、推奨していません。

    • プログラミングに関係のない質問
    • やってほしいことだけを記載した丸投げの質問
    • 問題・課題が含まれていない質問
    • 意図的に内容が抹消された質問
    • 過去に投稿した質問と同じ内容の質問
    • 広告と受け取られるような投稿

    評価が下がると、TOPページの「アクティブ」「注目」タブのフィードに表示されにくくなります。

    質問の評価を下げたことを取り消します

    この機能は開放されていません

    評価を下げる条件を満たしてません

    評価を下げる理由を選択してください

    詳細な説明はこちら

    上記に当てはまらず、質問内容が明確になっていない質問には「情報の追加・修正依頼」機能からコメントをしてください。

    質問の評価を下げる機能の利用条件

    この機能を利用するためには、以下の事項を行う必要があります。

回答 1

checkベストアンサー

0

さっぱりわからないので何も試してません

エラー文が出ているのであれば、コピペしてググるなり翻訳かけるなり出来る事は沢山あるとおもいますが。

ぱっと気になった部分だと

Your project path contains non-ASCII characters. This will most likely cause the build to fail on Windows. Please move your project to a different directory. 

プロジェクトファイルのパスの中に非ASCII文字、今回の場合だと日本語が含まれているのでこういうエラーが出る事があります。それを直してやればいいです。


蛇足ですが、2020.1.0b3のようなaやbのついたバージョンはα版、β版といった開発段階のものなのでエディター自体に意図しない不具合がある可能性があります。
特にこだわりが無ければ、そういったバージョンは避けたほうが安全かと思います。

投稿

  • 回答の評価を上げる

    以下のような回答は評価を上げましょう

    • 正しい回答
    • わかりやすい回答
    • ためになる回答

    評価が高い回答ほどページの上位に表示されます。

  • 回答の評価を下げる

    下記のような回答は推奨されていません。

    • 間違っている回答
    • 質問の回答になっていない投稿
    • スパムや攻撃的な表現を用いた投稿

    評価を下げる際はその理由を明確に伝え、適切な回答に修正してもらいましょう。

  • 2020/04/03 21:18

    対応遅れてすみません、ありがとうございました!!!

    キャンセル

15分調べてもわからないことは、teratailで質問しよう!

  • ただいまの回答率 88.91%
  • 質問をまとめることで、思考を整理して素早く解決
  • テンプレート機能で、簡単に質問をまとめられる

関連した質問

同じタグがついた質問を見る