質問をすることでしか得られない、回答やアドバイスがある。

15分調べてもわからないことは、質問しよう!

新規登録して質問してみよう
ただいま回答率
86.12%
MacOS(OSX)

MacOSとは、Appleの開発していたGUI(グラフィカルユーザーインターフェース)を採用したオペレーションシステム(OS)です。Macintoshと共に、市場に出てGUIの普及に大きく貢献しました。

バージョン管理

バージョン管理はコンピューター上にファイルとして格納されているドキュメント・プログラム・その他の情報の変更履歴等を管理するものです

Python

Pythonは、コードの読みやすさが特徴的なプログラミング言語の1つです。 強い型付け、動的型付けに対応しており、後方互換性がないバージョン2系とバージョン3系が使用されています。 商用製品の開発にも無料で使用でき、OSだけでなく仮想環境にも対応。Unicodeによる文字列操作をサポートしているため、日本語処理も標準で可能です。

解決済

macにPython3.9.0をpyenvでインストールを行おうと思ったのですが、エラーが出てインストール出来ません

haruuu
haruuu

総合スコア1

MacOS(OSX)

MacOSとは、Appleの開発していたGUI(グラフィカルユーザーインターフェース)を採用したオペレーションシステム(OS)です。Macintoshと共に、市場に出てGUIの普及に大きく貢献しました。

バージョン管理

バージョン管理はコンピューター上にファイルとして格納されているドキュメント・プログラム・その他の情報の変更履歴等を管理するものです

Python

Pythonは、コードの読みやすさが特徴的なプログラミング言語の1つです。 強い型付け、動的型付けに対応しており、後方互換性がないバージョン2系とバージョン3系が使用されています。 商用製品の開発にも無料で使用でき、OSだけでなく仮想環境にも対応。Unicodeによる文字列操作をサポートしているため、日本語処理も標準で可能です。

1回答

0リアクション

1クリップ

3846閲覧

投稿2020/12/11 04:54

編集2020/12/11 12:29

前提・実現したいこと

macにpython3.9.0をインストールしようとしたのですが、エラーが出てしまいます。
どのように解決すれば良いか教えてください。
やったことは、 Homebrewのインストール、pyenvのインストールを行った後にecho $SHELLをターミナルに入力して、実行結果が /bin/zshだったので、(echo 'export PYENV_ROOT="$HOME/.pyenv"' >> ~/.zshrc)(echo 'export PATH="$PYENV_ROOT/bin:$PATH"' >> ~/.zshrc)(echo 'eval "$(pyenv init -)"' >> ~/.zshrc)(source ~/.zshrc)を順にターミナルに入力しました。この後にpythonをインストールするとなっているのですが、インストールを行えば以下のエラーが出てしまいます。

発生している問題・エラーメッセージ

エラーメッセージ 1 error generated. make: *** [Modules/posixmodule.o] Error 1 make: *** Waiting for unfinished jobs.... 1 warning generated. ### 該当のソースコード ```ここに言語名を入力 ソースコード pyenv install 3.8.3 python-build: use openssl@1.1 from homebrew python-build: use readline from homebrew Downloading Python-3.8.3.tar.xz... -> https://www.python.org/ftp/python/3.8.3/Python-3.8.3.tar.xz Installing Python-3.8.3... python-build: use readline from homebrew python-build: use zlib from xcode sdk BUILD FAILED (OS X 11.0.1 using python-build 20180424) Inspect or clean up the working tree at /var/folders/2t/xh4k3jk52ln4ldzkjqy9x9cc0000gn/T/python-build.20201211115028.36328 Results logged to /var/folders/2t/xh4k3jk52ln4ldzkjqy9x9cc0000gn/T/python-build.20201211115028.36328.log Last 10 log lines: ^ clang -c -Wno-unused-result -Wsign-compare -Wunreachable-code -DNDEBUG -g -fwrapv -O3 -Wall -I/Library/Developer/CommandLineTools/SDKs/MacOSX.sdk/usr/include -I/Library/Developer/CommandLineTools/SDKs/MacOSX.sdk/usr/include -std=c99 -Wextra -Wno-unused-result -Wno-unused-parameter -Wno-missing-field-initializers -Wstrict-prototypes -Werror=implicit-function-declaration -I./Include/internal -I. -I./Include -I/usr/local/opt/readline/include -I/usr/local/opt/readline/include -I/Users/tateiwaharutaka/.pyenv/versions/3.8.3/include -I/usr/local/opt/readline/include -I/usr/local/opt/readline/include -I/Users/tateiwaharutaka/.pyenv/versions/3.8.3/include -DPy_BUILD_CORE -o Modules/gcmodule.o Modules/gcmodule.c clang -Wno-unused-result -Wsign-compare -Wunreachable-code -DNDEBUG -g -fwrapv -O3 -Wall -I/Library/Developer/CommandLineTools/SDKs/MacOSX.sdk/usr/include -I/Library/Developer/CommandLineTools/SDKs/MacOSX.sdk/usr/include -std=c99 -Wextra -Wno-unused-result -Wno-unused-parameter -Wno-missing-field-initializers -Wstrict-prototypes -Werror=implicit-function-declaration -I./Include/internal -I. -I./Include -I/usr/local/opt/readline/include -I/usr/local/opt/readline/include -I/Users/tateiwaharutaka/.pyenv/versions/3.8.3/include -I/usr/local/opt/readline/include -I/usr/local/opt/readline/include -I/Users/tateiwaharutaka/.pyenv/versions/3.8.3/include -DPy_BUILD_CORE_BUILTIN -DPy_BUILD_CORE_BUILTIN -I./Include/internal -c ./Modules/posixmodule.c -o Modules/posixmodule.o ./Modules/posixmodule.c:9221:15: error: implicit declaration of function 'sendfile' is invalid in C99 [-Werror,-Wimplicit-function-declaration] ret = sendfile(in, out, offset, &sbytes, &sf, flags); ^ 1 error generated. make: *** [Modules/posixmodule.o] Error 1 make: *** Waiting for unfinished jobs.... 1 warning generated. tateiwaharutaka@tateiwaryoudakanoMacBook-Air ~ % pyenv versions * system (set by /Users/tateiwaharutaka/.pyenv/version) ### 試したこと もう一度同じようにインストールを行ったりしました。 ### 補足情報(FW/ツールのバージョンなど) xcode-select version 2384.

以下のような質問にはリアクションをつけましょう

  • 質問内容が明確
  • 自分も答えを知りたい
  • 質問者以外のユーザにも役立つ

リアクションが多い質問は、TOPページの「注目」タブのフィードに表示されやすくなります。

気になる質問をクリップする

クリップした質問は、後からいつでもマイページで確認できます。

またクリップした質問に回答があった際、通知やメールを受け取ることができます。

下記のような質問は推奨されていません。

  • 間違っている
  • 質問になっていない投稿
  • スパムや攻撃的な表現を用いた投稿

適切な質問に修正を依頼しましょう。

quickquip

2020/12/11 05:02

CPUはIntelですか?
meg_

2020/12/11 05:03

ログファイルにはどこで失敗したのか詳細な情報が載っていませんでしたか?
haruuu

2020/12/11 05:18

MacBook Air (Retina, 13-inch, 2020) プロセッサ 1.1 GHz デュアルコアIntel Core i3 メモリ 8 GB 3733 MHz LPDDR4X グラフィックス Intel Iris Plus Graphics 1536 MB このような感じです。
haruuu

2020/12/11 05:24

どこが詳細な情報なのかわかりません。 教えていただければ、すぐ調べて返信致します。
t_obara

2020/12/11 05:27

Xcode Command Line Toolsは最新でしょうか?
haruuu

2020/12/11 05:47

Xcode Command Line Toolsは入っていないと思います。
quickquip

2020/12/11 06:00

brew install readline bzip2 zlib はしてますか? xcode-select --version の実行結果を載せてください。 情報はこの欄(質問への追記・修正の依頼)ではなくて質問を編集して載せるようにしてください。
haruuu

2020/12/11 12:30

返信遅くなりすいません。 質問の補足情報に実行結果を載せています。 ご確認よろしくお願い致します。
quickquip

2020/12/11 14:18 編集

表題は3.9.0で質問は3.8.3なのですが、どちらが正しいですか? 入れたいのは3.8系ですか?

まだ回答がついていません

会員登録して回答してみよう

アカウントをお持ちの方は

15分調べてもわからないことは
teratailで質問しよう!

ただいまの回答率
86.12%

質問をまとめることで
思考を整理して素早く解決

テンプレート機能で
簡単に質問をまとめる

質問する

関連した質問

同じタグがついた質問を見る

MacOS(OSX)

MacOSとは、Appleの開発していたGUI(グラフィカルユーザーインターフェース)を採用したオペレーションシステム(OS)です。Macintoshと共に、市場に出てGUIの普及に大きく貢献しました。

バージョン管理

バージョン管理はコンピューター上にファイルとして格納されているドキュメント・プログラム・その他の情報の変更履歴等を管理するものです

Python

Pythonは、コードの読みやすさが特徴的なプログラミング言語の1つです。 強い型付け、動的型付けに対応しており、後方互換性がないバージョン2系とバージョン3系が使用されています。 商用製品の開発にも無料で使用でき、OSだけでなく仮想環境にも対応。Unicodeによる文字列操作をサポートしているため、日本語処理も標準で可能です。