質問をすることでしか得られない、回答やアドバイスがある。

15分調べてもわからないことは、質問しよう!

新規登録して質問してみよう
ただいま回答率
85.48%
Node.js

Node.jsとはGoogleのV8 JavaScriptエンジンを使用しているサーバーサイドのイベント駆動型プログラムです。

Sass

Sassは、プログラミング風のコードでCSSを生成できるスタイルシート言語です。 scss ファイルを、変換(コンパイル)してCSSファイルを作成します。

Q&A

解決済

2回答

8224閲覧

npm installを実行しても、node_modulesが作成されません

maru_1997

総合スコア58

Node.js

Node.jsとはGoogleのV8 JavaScriptエンジンを使用しているサーバーサイドのイベント駆動型プログラムです。

Sass

Sassは、プログラミング風のコードでCSSを生成できるスタイルシート言語です。 scss ファイルを、変換(コンパイル)してCSSファイルを作成します。

0グッド

0クリップ

投稿2022/04/19 22:54

node_modulesを追加したいのですが、以下エラーが出てしまい追加することができません。
エラーへの対処方法を教えていただきたいです。
gulp-cliまではインストールできていると思います。

C:\Users\user\Desktop\02_sample>npm install npm WARN deprecated source-map-url@0.4.1: See https://github.com/lydell/source-map-url#deprecated npm WARN deprecated urix@0.1.0: Please see https://github.com/lydell/urix#deprecated npm WARN deprecated har-validator@5.1.5: this library is no longer supported npm WARN deprecated source-map-resolve@0.5.3: See https://github.com/lydell/source-map-resolve#deprecated npm WARN deprecated chokidar@2.1.8: Chokidar 2 does not receive security updates since 2019. Upgrade to chokidar 3 with 15x fewer dependencies npm WARN deprecated resolve-url@0.2.1: https://github.com/lydell/resolve-url#deprecated npm WARN deprecated uuid@3.4.0: Please upgrade to version 7 or higher. Older versions may use Math.random() in certain circumstances, which is known to be problematic. See https://v8.dev/blog/math-random for details. npm WARN deprecated request@2.88.2: request has been deprecated, see https://github.com/request/request/issues/3142 npm WARN deprecated tar@2.2.2: This version of tar is no longer supported, and will not receive security updates. Please upgrade asap. npm ERR! code 1 npm ERR! path C:\Users\user\Desktop\02_sample\node_modules\node-sass npm ERR! command failed npm ERR! command C:\WINDOWS\system32\cmd.exe /d /s /c node scripts/build.js npm ERR! Building: C:\Program Files\nodejs\node.exe C:\Users\user\Desktop\02_sample\node_modules\node-gyp\bin\node-gyp.js rebuild --verbose --libsass_ext= --libsass_cflags= --libsass_ldflags= --libsass_library= npm ERR! gyp info it worked if it ends with ok npm ERR! gyp verb cli [ npm ERR! gyp verb cli 'C:\\Program Files\\nodejs\\node.exe', npm ERR! gyp verb cli 'C:\\Users\\user\\Desktop\\02_sample\\node_modules\\node-gyp\\bin\\node-gyp.js', npm ERR! gyp verb cli 'rebuild', npm ERR! gyp verb cli '--verbose', npm ERR! gyp verb cli '--libsass_ext=', npm ERR! gyp verb cli '--libsass_cflags=', npm ERR! gyp verb cli '--libsass_ldflags=', npm ERR! gyp verb cli '--libsass_library=' npm ERR! gyp verb cli ] npm ERR! gyp info using node-gyp@3.8.0 npm ERR! gyp info using node@16.14.2 | win32 | x64 npm ERR! gyp verb command rebuild [] npm ERR! gyp verb command clean [] npm ERR! gyp verb clean removing "build" directory npm ERR! gyp verb command configure [] npm ERR! gyp verb check python checking for Python executable "python2" in the PATH npm ERR! gyp verb `which` failed Error: not found: python2 npm ERR! gyp verb `which` failed at getNotFoundError (C:\Users\user\Desktop\02_sample\node_modules\which\which.js:13:12) npm ERR! gyp verb `which` failed at F (C:\Users\user\Desktop\02_sample\node_modules\which\which.js:68:19) npm ERR! gyp verb `which` failed at E (C:\Users\user\Desktop\02_sample\node_modules\which\which.js:80:29) npm ERR! gyp verb `which` failed at C:\Users\user\Desktop\02_sample\node_modules\which\which.js:89:16 npm ERR! gyp verb `which` failed at C:\Users\user\Desktop\02_sample\node_modules\isexe\index.js:42:5 npm ERR! gyp verb `which` failed at C:\Users\user\Desktop\02_sample\node_modules\isexe\windows.js:36:5 npm ERR! gyp verb `which` failed at FSReqCallback.oncomplete (node:fs:198:21) npm ERR! gyp verb `which` failed python2 Error: not found: python2 npm ERR! gyp verb `which` failed at getNotFoundError (C:\Users\user\Desktop\02_sample\node_modules\which\which.js:13:12) npm ERR! gyp verb `which` failed at F (C:\Users\user\Desktop\02_sample\node_modules\which\which.js:68:19) npm ERR! gyp verb `which` failed at E (C:\Users\user\Desktop\02_sample\node_modules\which\which.js:80:29) npm ERR! gyp verb `which` failed at C:\Users\user\Desktop\02_sample\node_modules\which\which.js:89:16 npm ERR! gyp verb `which` failed at C:\Users\user\Desktop\02_sample\node_modules\isexe\index.js:42:5 npm ERR! gyp verb `which` failed at C:\Users\user\Desktop\02_sample\node_modules\isexe\windows.js:36:5 npm ERR! gyp verb `which` failed at FSReqCallback.oncomplete (node:fs:198:21) { npm ERR! gyp verb `which` failed code: 'ENOENT' npm ERR! gyp verb `which` failed } npm ERR! gyp verb check python checking for Python executable "python" in the PATH npm ERR! gyp verb `which` failed Error: not found: python npm ERR! gyp verb `which` failed at getNotFoundError (C:\Users\user\Desktop\02_sample\node_modules\which\which.js:13:12) npm ERR! gyp verb `which` failed at F (C:\Users\user\Desktop\02_sample\node_modules\which\which.js:68:19) npm ERR! gyp verb `which` failed at E (C:\Users\user\Desktop\02_sample\node_modules\which\which.js:80:29) npm ERR! gyp verb `which` failed at C:\Users\user\Desktop\02_sample\node_modules\which\which.js:89:16 npm ERR! gyp verb `which` failed at C:\Users\user\Desktop\02_sample\node_modules\isexe\index.js:42:5 npm ERR! gyp verb `which` failed at C:\Users\user\Desktop\02_sample\node_modules\isexe\windows.js:36:5 npm ERR! gyp verb `which` failed at FSReqCallback.oncomplete (node:fs:198:21) npm ERR! gyp verb `which` failed python Error: not found: python npm ERR! gyp verb `which` failed at getNotFoundError (C:\Users\user\Desktop\02_sample\node_modules\which\which.js:13:12) npm ERR! gyp verb `which` failed at F (C:\Users\user\Desktop\02_sample\node_modules\which\which.js:68:19) npm ERR! gyp verb `which` failed at E (C:\Users\user\Desktop\02_sample\node_modules\which\which.js:80:29) npm ERR! gyp verb `which` failed at C:\Users\user\Desktop\02_sample\node_modules\which\which.js:89:16 npm ERR! gyp verb `which` failed at C:\Users\user\Desktop\02_sample\node_modules\isexe\index.js:42:5 npm ERR! gyp verb `which` failed at C:\Users\user\Desktop\02_sample\node_modules\isexe\windows.js:36:5 npm ERR! gyp verb `which` failed at FSReqCallback.oncomplete (node:fs:198:21) { npm ERR! gyp verb `which` failed code: 'ENOENT' npm ERR! gyp verb `which` failed } npm ERR! gyp verb could not find "python". checking python launcher npm ERR! gyp verb could not find "python". guessing location npm ERR! gyp verb ensuring that file exists: C:\Python27\python.exe npm ERR! gyp ERR! configure error npm ERR! gyp ERR! stack Error: Can't find Python executable "python", you can set the PYTHON env variable. npm ERR! gyp ERR! stack at PythonFinder.failNoPython (C:\Users\user\Desktop\02_sample\node_modules\node-gyp\lib\configure.js:484:19) npm ERR! gyp ERR! stack at PythonFinder.<anonymous> (C:\Users\user\Desktop\02_sample\node_modules\node-gyp\lib\configure.js:509:16) npm ERR! gyp ERR! stack at callback (C:\Users\user\Desktop\02_sample\node_modules\graceful-fs\polyfills.js:306:20) npm ERR! gyp ERR! stack at FSReqCallback.oncomplete (node:fs:198:21) npm ERR! gyp ERR! System Windows_NT 10.0.19044 npm ERR! gyp ERR! command "C:\\Program Files\\nodejs\\node.exe" "C:\\Users\\user\\Desktop\\02_sample\\node_modules\\node-gyp\\bin\\node-gyp.js" "rebuild" "--verbose" "--libsass_ext=" "--libsass_cflags=" "--libsass_ldflags=" "--libsass_library=" npm ERR! gyp ERR! cwd C:\Users\user\Desktop\02_sample\node_modules\node-sass npm ERR! gyp ERR! node -v v16.14.2 npm ERR! gyp ERR! node-gyp -v v3.8.0 npm ERR! gyp ERR! not ok npm ERR! Build failed with error code: 1 npm ERR! A complete log of this run can be found in: npm ERR! C:\Users\user\AppData\Local\npm-cache\_logs\2022-04-19T22_49_00_195Z-debug-0.log

気になる質問をクリップする

クリップした質問は、後からいつでもMYページで確認できます。

またクリップした質問に回答があった際、通知やメールを受け取ることができます。

バッドをするには、ログインかつ

こちらの条件を満たす必要があります。

退会済みユーザー

退会済みユーザー

2022/04/19 23:03

環境を書こう
maru_1997

2022/04/19 23:32

コメントありがとうございます。 Node.jsのv16.14.2(Windows)を使用しています。 返答になっていますでしょうか。
退会済みユーザー

退会済みユーザー

2022/04/20 00:17

Windows 10 (11?) PC に node-v16.14.2-x64.msi を使って npm を含めてインストール済みということですか? であればそのことを質問欄を編集して追記してください。
maru_1997

2022/04/20 04:02

承知しました、環境含めもう少し調べてからご質問させていただきます。
guest

回答2

0

SASSが「node-sassのメンテやめるわ」宣言してるから使うのやめよう。
参考記事: GMO Developers » node-sassからDartSassへsassコンパイラの移行

大勢が去った理由は悪名高きnode-gypだったりする
だから我先にと逃げ出したのね。


node-sassはnode-gypを内部で使ってるけどこのnode-gypがヤバい
これを使って別言語からコンパイルしつつ導入するんだけど、
兎に角エラー出まくりでハマりまくる。

特にWindowsユーザーにとってのnode-gypが鬼門過ぎる
「node-gyp windows」でググると大量に奮闘記事が引っかかる。
質問者さんだけじゃないってことね。teratail上にもnode-gypの質問が大量にある。

Node.jsをある程度知っている中上級者なら良いんだよ。
でもnode-gyp踏んでる人の大半がNode.js触りたてですとか、SASS使いたいだけですみたいな初心者。

なんでPython や Visual C++ を要求しはじめんの?
C++はNode.jsのコアなモジュールに関係してるから百歩譲ってわかるけど、
Python要求する意味が1ミリも理解出来ん。Node.jsで書き直すわけにはいかんの?

マイクロソフトがガイドラインを作ってくれたり、
windows-build-toolsを作ってくれてる人まで登場してる
もしnode-gypに立ち向かうなら参考にどうぞ。

もちろん逃げられるものなら逃げた方が良い。

投稿2022/04/20 01:15

miyabi-sun

総合スコア21158

バッドをするには、ログインかつ

こちらの条件を満たす必要があります。

0

ベストアンサー

そもそも論として、node-sass非推奨となっています(GitHub)。Dart Sass(npm上ではsass)に乗り換えましょう。

投稿2022/04/19 23:54

maisumakun

総合スコア145183

バッドをするには、ログインかつ

こちらの条件を満たす必要があります。

あなたの回答

tips

太字

斜体

打ち消し線

見出し

引用テキストの挿入

コードの挿入

リンクの挿入

リストの挿入

番号リストの挿入

表の挿入

水平線の挿入

プレビュー

15分調べてもわからないことは
teratailで質問しよう!

ただいまの回答率
85.48%

質問をまとめることで
思考を整理して素早く解決

テンプレート機能で
簡単に質問をまとめる

質問する

関連した質問