NPMを初めて利用するのですが、書籍のサンプルプロジェクトでnpm installを実行してください。
ということで実行すると下記の通り大量にエラーがでてしまうため、解消方法を教えていただきたいです。
実行環境
- Macbookpro
- node -v : v12.16.3
- npm -v 6.14.4
- which node
/usr/local/bin/node
- which npm
/usr/local/bin/npm
エラー内容
node-sassというのが原因っぽいのですが、いまいちよくわからずです。。
1 error generated. make: *** [Release/obj.target/binding/src/create_string.o] Error 1 gyp ERR! build error gyp ERR! stack Error: `make` failed with exit code: 2 gyp ERR! stack at ChildProcess.onExit (/Users/saitonozomi/Downloads/vue-app/chap11/reading-recorder/node_modules/node-gyp/lib/build.js:262:23) gyp ERR! stack at ChildProcess.emit (events.js:310:20) gyp ERR! stack at Process.ChildProcess._handle.onexit (internal/child_process.js:275:12) gyp ERR! System Darwin 19.3.0 gyp ERR! command "/usr/local/bin/node" "/Users/saitonozomi/Downloads/vue-app/chap11/reading-recorder/node_modules/node-gyp/bin/node-gyp.js" "rebuild" "--verbose" "--libsass_ext=" "--libsass_cflags=" "--libsass_ldflags=" "--libsass_library=" gyp ERR! cwd /Users/saitonozomi/Downloads/vue-app/chap11/reading-recorder/node_modules/node-sass gyp ERR! node -v v12.16.3 gyp ERR! node-gyp -v v3.8.0 gyp ERR! not ok Build failed with error code: 1 npm WARN optional SKIPPING OPTIONAL DEPENDENCY: fsevents@1.2.8 (node_modules/fsevents): npm WARN optional SKIPPING OPTIONAL DEPENDENCY: fsevents@1.2.8 install: `node install` npm WARN optional SKIPPING OPTIONAL DEPENDENCY: Exit status 1 npm ERR! code ELIFECYCLE npm ERR! errno 1 npm ERR! node-sass@4.11.0 postinstall: `node scripts/build.js` npm ERR! Exit status 1 npm ERR! npm ERR! Failed at the node-sass@4.11.0 postinstall script. npm ERR! This is probably not a problem with npm. There is likely additional logging output above. npm ERR! A complete log of this run can be found in: npm ERR! /Users/saitonozomi/.npm/_logs/2020-05-23T05_22_09_157Z-debug.log saitonozomi@Ns:~/Downloads/vue-app/chap11/reading-recorder$ node -v
回答1件
あなたの回答
tips
プレビュー
バッドをするには、ログインかつ
こちらの条件を満たす必要があります。