質問をすることでしか得られない、回答やアドバイスがある。

15分調べてもわからないことは、質問しよう!

ただいまの
回答率

90.61%

  • Ruby

    7358questions

    Rubyはプログラミング言語のひとつで、オープンソース、オブジェクト指向のプログラミング開発に対応しています。

  • Ruby on Rails

    7015questions

    Ruby on Railsは、オープンソースのWebアプリケーションフレームワークです。「同じことを繰り返さない」というRailsの基本理念のもと、他のフレームワークより少ないコードで簡単に開発できるよう設計されています。

bundle installができない エラー

解決済

回答 2

投稿 編集

  • 評価
  • クリップ 1
  • VIEW 803

FigHy

score 11

昨日、nokogiriのインストールでエラーが出るという質問を投稿させていただきました。
nokogiriのせいなのかと思っていたのですが、そもそもrails sもできないという状況です。
railsを消した記憶もないのですが・・・OSのバージョンアップのせいなのかどうなのか・・・
nokogiriも入っているみたいですが、バージョンが1.5.1みたいです。

bundlerはuser/local/binに入っています。
自分でもよくわからなくなってきたため、もしよろしければ何か解決策をいただければと思います。
よろしくお願いします><

追記

$rbenv install 2.4.1
と打ちましたが、
$ ruby -v
ruby 2.3.3p222 (2016-11-21 revision 56859) [universal.x86_64-darwin17]
と、バージョンアップもできていません。

$ rails -v
Rails is not currently installed on this system. To get the latest version, simply type:

    $ sudo gem install rails

You can then rerun your "rails" command.


試したコマンドの1部

My:.bundle fig$ bundle config
Settings are listed in order of priority. The top value will be used.

My:~ fig$ gem install rails --version='4.2.6'
ERROR:  While executing gem ... (Gem::FilePermissionError)
    You don't have write permissions for the /Library/Ruby/Gems/2.3.0 directory.

My:~ fig$ gem install bundler
ERROR:  While executing gem ... (Gem::FilePermissionError)
    You don't have write permissions for the /Library/Ruby/Gems/2.3.0 directory.

My:~ fig$ rails -v
Rails is not currently installed on this system. To get the latest version, simply type:

    $ sudo gem install rails

You can then rerun your "rails" command.

My:spacemarket fig$ bundle install --path vendor/bundle
/Library/Ruby/Site/2.3.0/rubygems.rb:289:in `find_spec_for_exe': can't find gem bundler (>= 0.a) with executable bundle (Gem::GemNotFoundException)
    from /Library/Ruby/Site/2.3.0/rubygems.rb:263:in `bin_path'
    from /usr/local/bin/bundle:22:in `<main>'

My:spacemarket fig$ bundler -v
/Library/Ruby/Site/2.3.0/rubygems.rb:289:in `find_spec_for_exe': can't find gem bundler (>= 0.a) with executable bundler (Gem::GemNotFoundException)
    from /Library/Ruby/Site/2.3.0/rubygems.rb:263:in `bin_path'
    from /usr/local/bin/bundler:22:in `<main>'

My:spacemarket fig$ sudo gem install rails
Password:
Building native extensions. This could take a while...
ERROR:  Error installing rails:
    ERROR: Failed to build gem native extension.

    current directory: /Library/Ruby/Gems/2.3.0/gems/nokogiri-1.8.1/ext/nokogiri
/System/Library/Frameworks/Ruby.framework/Versions/2.3/usr/bin/ruby -r ./siteconf20180116-32652-18sk4ej.rb extconf.rb
checking if the C compiler accepts ... yes
checking if the C compiler accepts -Wno-error=unused-command-line-argument-hard-error-in-future... no
Building nokogiri using packaged libraries.
Using mini_portile version 2.3.0
checking for iconv.h... yes
checking for gzdopen() in -lz... yes
checking for iconv... yes
************************************************************************
IMPORTANT NOTICE:

Building Nokogiri with a packaged version of libxml2-2.9.5.

Team Nokogiri will keep on doing their best to provide security
updates in a timely manner, but if this is a concern for you and want
to use the system library instead; abort this installation process and
reinstall nokogiri as follows:

    gem install nokogiri -- --use-system-libraries
        [--with-xml2-config=/path/to/xml2-config]
        [--with-xslt-config=/path/to/xslt-config]

If you are using Bundler, tell it to use the option:

    bundle config build.nokogiri --use-system-libraries
    bundle install

Note, however, that nokogiri is not fully compatible with arbitrary
versions of libxml2 provided by OS/package vendors.
************************************************************************
Extracting libxml2-2.9.5.tar.gz into tmp/x86_64-apple-darwin17/ports/libxml2/2.9.5... OK
Running 'configure' for libxml2 2.9.5... OK
Running 'compile' for libxml2 2.9.5... ERROR, review '/Library/Ruby/Gems/2.3.0/gems/nokogiri-1.8.1/ext/nokogiri/tmp/x86_64-apple-darwin17/ports/libxml2/2.9.5/compile.log' to see what happened. Last lines are:
========================================================================
  CCLD     libxml2.la
  CC       testdso.lo
  CCLD     testdso.la
  CC       xmllint.o
  CCLD     xmllint
ld: warning: ignoring file /usr/local/Cellar/xz/5.2.3/lib/liblzma.dylib, file was built for x86_64 which is not the architecture being linked (i386): /usr/local/Cellar/xz/5.2.3/lib/liblzma.dylib
Undefined symbols for architecture i386:
  "_lzma_auto_decoder", referenced from:
      _xz_head in libxml2.a(xzlib.o)
  "_lzma_code", referenced from:
      _xz_decomp in libxml2.a(xzlib.o)
  "_lzma_end", referenced from:
      ___libxml2_xzclose in libxml2.a(xzlib.o)
  "_lzma_properties_decode", referenced from:
      _is_format_lzma in libxml2.a(xzlib.o)
ld: symbol(s) not found for architecture i386
clang: error: linker command failed with exit code 1 (use -v to see invocation)
make[2]: *** [xmllint] Error 1
make[1]: *** [all-recursive] Error 1
make: *** [all] Error 2
========================================================================
*** extconf.rb failed ***
Could not create Makefile due to some reason, probably lack of necessary
libraries and/or headers.  Check the mkmf.log file for more details.  You may
need configuration options.

Provided configuration options:
    --with-opt-dir
    --without-opt-dir
    --with-opt-include
    --without-opt-include=${opt-dir}/include
    --with-opt-lib
    --without-opt-lib=${opt-dir}/lib
    --with-make-prog
    --without-make-prog
    --srcdir=.
    --curdir
    --ruby=/System/Library/Frameworks/Ruby.framework/Versions/2.3/usr/bin/$(RUBY_BASE_NAME)
    --help
    --clean
    --use-system-libraries
    --enable-static
    --disable-static
    --with-zlib-dir
    --without-zlib-dir
    --with-zlib-include
    --without-zlib-include=${zlib-dir}/include
    --with-zlib-lib
    --without-zlib-lib=${zlib-dir}/lib
    --enable-cross-build
    --disable-cross-build
/Library/Ruby/Gems/2.3.0/gems/mini_portile2-2.3.0/lib/mini_portile2/mini_portile.rb:402:in `block in execute': Failed to complete compile task (RuntimeError)
    from /Library/Ruby/Gems/2.3.0/gems/mini_portile2-2.3.0/lib/mini_portile2/mini_portile.rb:373:in `chdir'
    from /Library/Ruby/Gems/2.3.0/gems/mini_portile2-2.3.0/lib/mini_portile2/mini_portile.rb:373:in `execute'
    from /Library/Ruby/Gems/2.3.0/gems/mini_portile2-2.3.0/lib/mini_portile2/mini_portile.rb:115:in `compile'
    from /Library/Ruby/Gems/2.3.0/gems/mini_portile2-2.3.0/lib/mini_portile2/mini_portile.rb:154:in `cook'
    from extconf.rb:365:in `block (2 levels) in process_recipe'
    from extconf.rb:257:in `block in chdir_for_build'
    from extconf.rb:256:in `chdir'
    from extconf.rb:256:in `chdir_for_build'
    from extconf.rb:364:in `block in process_recipe'
    from extconf.rb:262:in `tap'
    from extconf.rb:262:in `process_recipe'
    from extconf.rb:548:in `<main>'

To see why this extension failed to compile, please check the mkmf.log which can be found here:

  /Library/Ruby/Gems/2.3.0/extensions/universal-darwin-17/2.3.0/nokogiri-1.8.1/mkmf.log

extconf failed, exit code 1

Gem files will remain installed in /Library/Ruby/Gems/2.3.0/gems/nokogiri-1.8.1 for inspection.
Results logged to /Library/Ruby/Gems/2.3.0/extensions/universal-darwin-17/2.3.0/nokogiri-1.8.1/gem_make.out
  • 気になる質問をクリップする

    クリップした質問は、後からいつでもマイページで確認できます。

    またクリップした質問に回答があった際、通知やメールを受け取ることができます。

    クリップを取り消します

  • 良い質問の評価を上げる

    以下のような質問は評価を上げましょう

    • 質問内容が明確
    • 自分も答えを知りたい
    • 質問者以外のユーザにも役立つ

    評価が高い質問は、TOPページの「注目」タブのフィードに表示されやすくなります。

    質問の評価を上げたことを取り消します

  • 評価を下げられる数の上限に達しました

    評価を下げることができません

    • 1日5回まで評価を下げられます
    • 1日に1ユーザに対して2回まで評価を下げられます

    質問の評価を下げる

    teratailでは下記のような質問を「具体的に困っていることがない質問」、「サイトポリシーに違反する質問」と定義し、推奨していません。

    • プログラミングに関係のない質問
    • やってほしいことだけを記載した丸投げの質問
    • 問題・課題が含まれていない質問
    • 意図的に内容が抹消された質問
    • 広告と受け取られるような投稿

    評価が下がると、TOPページの「アクティブ」「注目」タブのフィードに表示されにくくなります。

    質問の評価を下げたことを取り消します

    この機能は開放されていません

    評価を下げる条件を満たしてません

    評価を下げる理由を選択してください

    詳細な説明はこちら

    上記に当てはまらず、質問内容が明確になっていない質問には「情報の追加・修正依頼」機能からコメントをしてください。

    質問の評価を下げる機能の利用条件

    この機能を利用するためには、以下の事項を行う必要があります。

回答 2

checkベストアンサー

+2

まず rbenv global でしっかり対象バージョンのrubyにrbenvがスイッチしているか確認してください
それで変更されているならbundler, gemともにrbenvでインストールしているruby以下のパスでないためこのエラーが起こっていると思われます。

rbenvでインストールしたrubyのgemは以下のパスにビルドされます.
/Users/hogehoge/.rbenv/versions/2.5.0/lib/ruby/gems/2.5.0/gems/bundler-1.16.1/
しかし, パスはsystemに入っているruby, 及びgemを参照するため食い違いが起こっているわけです.
要はパスを書き換えてしまえばいいのですがそれだと色々面倒なことになるので今回は違う解決策を載せておきます.
私もこの問題に陥ったため, 私の場合での解決策だと予めご了承ください.

  • sudo rbenv exec gem install bundler
  • rbenv exec bundle install --path=vendor/bundle

これでディレクトリ内のgemfileをinstallできます。
もし個別にgemをインストールしたい場合は rbenv exec gem install hogehoge
としてください.

rbenv exec の意味はrbenvでglobalになっているrubyのgemやbundlerを指定して実行します。
これによって上記の/Users/hogehoge/.rbenv/versions/2.5.0/lib/ruby/gems/2.5.0/gems
以下にgemがインストールされ, rbenv exec bundlerで, このgems以下のbundlerを指定しているということです.

これでインストールされたgem, 例えばrailsをコマンドとして実行したい場合は
rbenv exec bundler exec rails new などで実行が可能です.
コマンドが冗長になってしまうのでそれが嫌であればaliasするかpathをわかりやすいようにexportしたほうが良いかもしれません

これで解決できない場合は一度rbenvを消し, system側のrubyも再インストールしたほうが手っ取り早いかもしれません

投稿

編集

  • 回答の評価を上げる

    以下のような回答は評価を上げましょう

    • 正しい回答
    • わかりやすい回答
    • ためになる回答

    評価が高い回答ほどページの上位に表示されます。

  • 回答の評価を下げる

    下記のような回答は推奨されていません。

    • 間違っている回答
    • 質問の回答になっていない投稿
    • スパムや攻撃的な表現を用いた投稿

    評価を下げる際はその理由を明確に伝え、適切な回答に修正してもらいましょう。

  • 2018/01/22 02:40

    ありがとうございました!無事に解決することができました!

    キャンセル

+1

すでに見ているかもしれませんが、失敗ログが以下のファイルに記載されていると思いますので、もし見ていないのであれば見てみるのもいいかと思います。

/Library/Ruby/Gems/2.3.0/extensions/universal-darwin-17/2.3.0/nokogiri-1.8.1/mkmf.log

結局、nokogiriがコンパイル失敗してインストール失敗していると思います。ライブラリが不足しているからからnokogiriコンパイルできないというパターンは自分も遭遇したことがあります。

その時は、libxml2libxsltlibiconvをOS上にインストールしたら行けました。

以下も参考にしてみてはいかがでしょうか。

https://qiita.com/omega999/items/cd0420aae064cfddc725

投稿

  • 回答の評価を上げる

    以下のような回答は評価を上げましょう

    • 正しい回答
    • わかりやすい回答
    • ためになる回答

    評価が高い回答ほどページの上位に表示されます。

  • 回答の評価を下げる

    下記のような回答は推奨されていません。

    • 間違っている回答
    • 質問の回答になっていない投稿
    • スパムや攻撃的な表現を用いた投稿

    評価を下げる際はその理由を明確に伝え、適切な回答に修正してもらいましょう。

  • 2018/01/22 02:40

    ありがとうございました!

    キャンセル

15分調べてもわからないことは、teratailで質問しよう!

  • ただいまの回答率 90.61%
  • 質問をまとめることで、思考を整理して素早く解決
  • テンプレート機能で、簡単に質問をまとめられる

関連した質問

同じタグがついた質問を見る

  • Ruby

    7358questions

    Rubyはプログラミング言語のひとつで、オープンソース、オブジェクト指向のプログラミング開発に対応しています。

  • Ruby on Rails

    7015questions

    Ruby on Railsは、オープンソースのWebアプリケーションフレームワークです。「同じことを繰り返さない」というRailsの基本理念のもと、他のフレームワークより少ないコードで簡単に開発できるよう設計されています。