質問をすることでしか得られない、回答やアドバイスがある。

15分調べてもわからないことは、質問しよう!

ただいまの
回答率

89.97%

androidstudio mysql接続

解決済

回答 1

投稿 編集

  • 評価
  • クリップ 0
  • VIEW 1,808

cray

score 27

androidでmysqlと連携させて動くアプリを開発しようとしています。

連携のやり方がわからなかったので
http://web.sfc.wide.ad.jp/~tinaba/tutorials/mysql-ja/

こちらのサイトを参考にやってみたのですがエラーが出てしまいました。

エラーコード

Information:Gradle tasks [:app:incrementalDebugSupportDex]
:app:buildInfoDebugLoader
:app:preBuild UP-TO-DATE
:app:preDebugBuild UP-TO-DATE
:app:checkDebugManifest
:app:preReleaseBuild UP-TO-DATE
:app:prepareComAndroidSupportAnimatedVectorDrawable2330Library UP-TO-DATE
:app:prepareComAndroidSupportAppcompatV72330Library UP-TO-DATE
:app:prepareComAndroidSupportSupportV42330Library UP-TO-DATE
:app:prepareComAndroidSupportSupportVectorDrawable2330Library UP-TO-DATE
:app:prepareDebugDependencies
:app:compileDebugAidl UP-TO-DATE
:app:compileDebugRenderscript UP-TO-DATE
:app:generateDebugBuildConfig UP-TO-DATE
:app:mergeDebugShaders UP-TO-DATE
:app:compileDebugShaders UP-TO-DATE
:app:generateDebugAssets UP-TO-DATE
:app:mergeDebugAssets UP-TO-DATE
:app:generateDebugResValues UP-TO-DATE
:app:generateDebugResources UP-TO-DATE
:app:mergeDebugResources UP-TO-DATE
:app:processDebugManifest
:app:processDebugResources
:app:generateDebugSources
:app:incrementalDebugJavaCompilationSafeguard UP-TO-DATE
:app:compileDebugJavaWithJavac
None of the classes needs to be compiled! Analysis took 0.095 secs. 
:app:transformClassesWithExtractJarsForDebug
:app:transformClassesWithInstantRunVerifierForDebug
:app:transformClassesWithJavaResourcesVerifierForDebug UP-TO-DATE
:app:compileDebugNdk UP-TO-DATE
:app:mergeDebugJniLibFolders UP-TO-DATE
:app:transformNative_libsWithMergeJniLibsForDebug
:app:processDebugJavaRes UP-TO-DATE
:app:transformResourcesWithMergeJavaResForDebug
:app:transformResourcesAndNative_libsWithJavaResourcesVerifierForDebug
:app:transformClassesWithInstantRunForDebug FAILED
Error:Execution failed for task ':app:transformClassesWithInstantRunForDebug'.
> JSR/RET are not supported with computeFrames option
Information:BUILD FAILED
Information:Total time: 9.069 secs
Information:1 error
Information:0 warnings
Information:See complete output in console


connectorは5.1と3.1を試しましたが駄目でした。
一応androidstudioの再起動もしました。

ソースコードは先ほどのサイトと同じにしてあります。原因がわかりますでしょうか?

androidstudio2.1
nexus7 APIレベル23で開発しています。

よろしくお願いします

  • 気になる質問をクリップする

    クリップした質問は、後からいつでもマイページで確認できます。

    またクリップした質問に回答があった際、通知やメールを受け取ることができます。

    クリップを取り消します

  • 良い質問の評価を上げる

    以下のような質問は評価を上げましょう

    • 質問内容が明確
    • 自分も答えを知りたい
    • 質問者以外のユーザにも役立つ

    評価が高い質問は、TOPページの「注目」タブのフィードに表示されやすくなります。

    質問の評価を上げたことを取り消します

  • 評価を下げられる数の上限に達しました

    評価を下げることができません

    • 1日5回まで評価を下げられます
    • 1日に1ユーザに対して2回まで評価を下げられます

    質問の評価を下げる

    teratailでは下記のような質問を「具体的に困っていることがない質問」、「サイトポリシーに違反する質問」と定義し、推奨していません。

    • プログラミングに関係のない質問
    • やってほしいことだけを記載した丸投げの質問
    • 問題・課題が含まれていない質問
    • 意図的に内容が抹消された質問
    • 広告と受け取られるような投稿

    評価が下がると、TOPページの「アクティブ」「注目」タブのフィードに表示されにくくなります。

    質問の評価を下げたことを取り消します

    この機能は開放されていません

    評価を下げる条件を満たしてません

    評価を下げる理由を選択してください

    詳細な説明はこちら

    上記に当てはまらず、質問内容が明確になっていない質問には「情報の追加・修正依頼」機能からコメントをしてください。

    質問の評価を下げる機能の利用条件

    この機能を利用するためには、以下の事項を行う必要があります。

回答 1

checkベストアンサー

+1

インスタントランのビルドに失敗していますね。
デバッグ実行で実行していますか?

投稿

  • 回答の評価を上げる

    以下のような回答は評価を上げましょう

    • 正しい回答
    • わかりやすい回答
    • ためになる回答

    評価が高い回答ほどページの上位に表示されます。

  • 回答の評価を下げる

    下記のような回答は推奨されていません。

    • 間違っている回答
    • 質問の回答になっていない投稿
    • スパムや攻撃的な表現を用いた投稿

    評価を下げる際はその理由を明確に伝え、適切な回答に修正してもらいましょう。

  • 2016/07/05 14:16

    Information:Gradle tasks [:app:assembleDebug]
    :app:preBuild UP-TO-DATE
    :app:preDebugBuild UP-TO-DATE
    :app:checkDebugManifest
    :app:preReleaseBuild UP-TO-DATE
    :app:prepareComAndroidSupportAnimatedVectorDrawable2330Library UP-TO-DATE
    :app:prepareComAndroidSupportAppcompatV72330Library UP-TO-DATE
    :app:prepareComAndroidSupportSupportV42330Library UP-TO-DATE
    :app:prepareComAndroidSupportSupportVectorDrawable2330Library UP-TO-DATE
    :app:prepareDebugDependencies
    :app:compileDebugAidl UP-TO-DATE
    :app:compileDebugRenderscript UP-TO-DATE
    :app:generateDebugBuildConfig UP-TO-DATE
    :app:mergeDebugShaders UP-TO-DATE
    :app:compileDebugShaders UP-TO-DATE
    :app:generateDebugAssets UP-TO-DATE
    :app:mergeDebugAssets UP-TO-DATE
    :app:generateDebugResValues UP-TO-DATE
    :app:generateDebugResources UP-TO-DATE
    :app:mergeDebugResources UP-TO-DATE
    :app:processDebugManifest UP-TO-DATE
    :app:processDebugResources UP-TO-DATE
    :app:generateDebugSources UP-TO-DATE
    :app:incrementalDebugJavaCompilationSafeguard UP-TO-DATE
    :app:compileDebugJavaWithJavac UP-TO-DATE
    :app:compileDebugNdk UP-TO-DATE
    :app:compileDebugSources UP-TO-DATE
    :app:buildInfoDebugLoader
    :app:transformClassesWithExtractJarsForDebug UP-TO-DATE
    :app:transformClassesWithInstantRunVerifierForDebug UP-TO-DATE
    :app:transformClassesWithJavaResourcesVerifierForDebug UP-TO-DATE
    :app:mergeDebugJniLibFolders UP-TO-DATE
    :app:transformNative_libsWithMergeJniLibsForDebug UP-TO-DATE
    :app:processDebugJavaRes UP-TO-DATE
    :app:transformResourcesWithMergeJavaResForDebug UP-TO-DATE
    :app:transformResourcesAndNative_libsWithJavaResourcesVerifierForDebug UP-TO-DATE
    :app:transformClassesWithInstantRunForDebug FAILED
    Error:Execution failed for task ':app:transformClassesWithInstantRunForDebug'.
    > JSR/RET are not supported with computeFrames option
    Information:BUILD FAILED
    Information:Total time: 10.236 secs
    Information:1 error
    Information:0 warnings
    Information:See complete output in console

    と表示されます。
    Error:Execution failed for task ':app:transformClassesWithInstantRunForDebug'.
    > JSR/RET are not supported with computeFrames option
    というエラーメッセージが出ています。

    キャンセル

  • 2016/07/05 14:26

    インスタントランを無効にしてみてください。

    キャンセル

  • 2016/07/05 14:54

    インスタントランを無効にしたら無事動きました!本当に助かりましたいつもいつもありがとうございます!

    キャンセル

15分調べてもわからないことは、teratailで質問しよう!

  • ただいまの回答率 89.97%
  • 質問をまとめることで、思考を整理して素早く解決
  • テンプレート機能で、簡単に質問をまとめられる

同じタグがついた質問を見る