質問をすることでしか得られない、回答やアドバイスがある。

15分調べてもわからないことは、質問しよう!

ただいまの
回答率

87.48%

[Flutter] Library Dart Packages has broken classes path:というエラーについて

受付中

回答 0

投稿

  • 評価
  • クリップ 0
  • VIEW 163

score 28

flutterで作っているアプリをビルドすると、次のようなエラーが出ました。

Launching lib/main.dart on sdk google atv x86 in debug mode...
Running Gradle task 'assembleDebug'...
java.nio.file.NoSuchFileException: /Users/hoge/app-tv-app/build/app/intermediates/external_file_lib_dex_archives/debug/out
    at sun.nio.fs.UnixException.translateToIOException(UnixException.java:86)
    at sun.nio.fs.UnixException.rethrowAsIOException(UnixException.java:102)
    at sun.nio.fs.UnixException.rethrowAsIOException(UnixException.java:107)
    at sun.nio.fs.UnixFileSystemProvider.newDirectoryStream(UnixFileSystemProvider.java:407)
    at java.nio.file.Files.newDirectoryStream(Files.java:457)
    at java.nio.file.Files.list(Files.java:3451)
    at com.android.build.gradle.internal.tasks.DexMergingParams.getAllDexFiles(DexMergingTask.kt:502)
    at com.android.build.gradle.internal.tasks.DexMergingTaskRunnable.run(DexMergingTask.kt:423)
    at com.android.build.gradle.internal.tasks.Workers$ActionFacade.run(Workers.kt:335)
    at org.gradle.workers.internal.AdapterWorkAction.execute(AdapterWorkAction.java:50)
    at org.gradle.workers.internal.DefaultWorkerServer.execute(DefaultWorkerServer.java:47)
    at org.gradle.workers.internal.NoIsolationWorkerFactory$1$1$1.create(NoIsolationWorkerFactory.java:65)
    at org.gradle.workers.internal.NoIsolationWorkerFactory$1$1$1.create(NoIsolationWorkerFactory.java:61)
    at org.gradle.internal.classloader.ClassLoaderUtils.executeInClassloader(ClassLoaderUtils.java:98)
    at org.gradle.workers.internal.NoIsolationWorkerFactory$1$1.execute(NoIsolationWorkerFactory.java:61)
    at org.gradle.workers.internal.AbstractWorker$1.call(AbstractWorker.java:44)
    at org.gradle.workers.internal.AbstractWorker$1.call(AbstractWorker.java:41)
    at org.gradle.internal.operations.DefaultBuildOperationExecutor$CallableBuildOperationWorker.execute(DefaultBuildOperationExecutor.java:416)
    at org.gradle.internal.operations.DefaultBuildOperationExecutor$CallableBuildOperationWorker.execute(DefaultBuildOperationExecutor.java:406)
    at org.gradle.internal.operations.DefaultBuildOperationExecutor$1.execute(DefaultBuildOperationExecutor.java:165)
    at org.gradle.internal.operations.DefaultBuildOperationExecutor.execute(DefaultBuildOperationExecutor.java:250)
    at org.gradle.internal.operations.DefaultBuildOperationExecutor.execute(DefaultBuildOperationExecutor.java:158)
    at org.gradle.internal.operations.DefaultBuildOperationExecutor.call(DefaultBuildOperationExecutor.java:102)
    at org.gradle.internal.operations.DelegatingBuildOperationExecutor.call(DelegatingBuildOperationExecutor.java:36)
    at org.gradle.workers.internal.AbstractWorker.executeWrappedInBuildOperation(AbstractWorker.java:41)
    at org.gradle.workers.internal.NoIsolationWorkerFactory$1.execute(NoIsolationWorkerFactory.java:56)
    at org.gradle.workers.internal.DefaultWorkerExecutor$3.call(DefaultWorkerExecutor.java:215)
    at org.gradle.workers.internal.DefaultWorkerExecutor$3.call(DefaultWorkerExecutor.java:210)
    at java.util.concurrent.FutureTask.run(FutureTask.java:266)
    at org.gradle.internal.work.DefaultConditionalExecutionQueue$ExecutionRunner.runExecution(DefaultConditionalExecutionQueue.java:215)
    at org.gradle.internal.work.DefaultConditionalExecutionQueue$ExecutionRunner.runBatch(DefaultConditionalExecutionQueue.java:164)
    at org.gradle.internal.work.DefaultConditionalExecutionQueue$ExecutionRunner.run(DefaultConditionalExecutionQueue.java:131)
    at java.util.concurrent.Executors$RunnableAdapter.call(Executors.java:511)
    at java.util.concurrent.FutureTask.run(FutureTask.java:266)
    at org.gradle.internal.concurrent.ExecutorPolicy$CatchAndRecordFailures.onExecute(ExecutorPolicy.java:64)
    at org.gradle.internal.concurrent.ManagedExecutorImpl$1.run(ManagedExecutorImpl.java:48)
    at java.util.concurrent.ThreadPoolExecutor.runWorker(ThreadPoolExecutor.java:1149)
    at java.util.concurrent.ThreadPoolExecutor$Worker.run(ThreadPoolExecutor.java:624)
    at org.gradle.internal.concurrent.ThreadFactoryImpl$ManagedThreadRunnable.run(ThreadFactoryImpl.java:56)
    at java.lang.Thread.run(Thread.java:748)


FAILURE: Build failed with an exception.

* What went wrong:
Execution failed for task ':app:mergeExtDexDebug'.
> A failure occurred while executing com.android.build.gradle.internal.tasks.Workers$ActionFacade
   > java.nio.file.NoSuchFileException: /Users/hoge/Launching lib/main.dart on sdk google atv x86 in debug mode...
Running Gradle task 'assembleDebug'...
java.nio.file.NoSuchFileException: /Users/tsudashouki/app-tv-app/build/app/intermediates/external_file_lib_dex_archives/debug/out
    at sun.nio.fs.UnixException.translateToIOException(UnixException.java:86)
    at sun.nio.fs.UnixException.rethrowAsIOException(UnixException.java:102)
    at sun.nio.fs.UnixException.rethrowAsIOException(UnixException.java:107)
    at sun.nio.fs.UnixFileSystemProvider.newDirectoryStream(UnixFileSystemProvider.java:407)
    at java.nio.file.Files.newDirectoryStream(Files.java:457)
    at java.nio.file.Files.list(Files.java:3451)
    at com.android.build.gradle.internal.tasks.DexMergingParams.getAllDexFiles(DexMergingTask.kt:502)
    at com.android.build.gradle.internal.tasks.DexMergingTaskRunnable.run(DexMergingTask.kt:423)
    at com.android.build.gradle.internal.tasks.Workers$ActionFacade.run(Workers.kt:335)
    at org.gradle.workers.internal.AdapterWorkAction.execute(AdapterWorkAction.java:50)
    at org.gradle.workers.internal.DefaultWorkerServer.execute(DefaultWorkerServer.java:47)
    at org.gradle.workers.internal.NoIsolationWorkerFactory$1$1$1.create(NoIsolationWorkerFactory.java:65)
    at org.gradle.workers.internal.NoIsolationWorkerFactory$1$1$1.create(NoIsolationWorkerFactory.java:61)
    at org.gradle.internal.classloader.ClassLoaderUtils.executeInClassloader(ClassLoaderUtils.java:98)
    at org.gradle.workers.internal.NoIsolationWorkerFactory$1$1.execute(NoIsolationWorkerFactory.java:61)
    at org.gradle.workers.internal.AbstractWorker$1.call(AbstractWorker.java:44)
    at org.gradle.workers.internal.AbstractWorker$1.call(AbstractWorker.java:41)
    at org.gradle.internal.operations.DefaultBuildOperationExecutor$CallableBuildOperationWorker.execute(DefaultBuildOperationExecutor.java:416)
    at org.gradle.internal.operations.DefaultBuildOperationExecutor$CallableBuildOperationWorker.execute(DefaultBuildOperationExecutor.java:406)
    at org.gradle.internal.operations.DefaultBuildOperationExecutor$1.execute(DefaultBuildOperationExecutor.java:165)
    at org.gradle.internal.operations.DefaultBuildOperationExecutor.execute(DefaultBuildOperationExecutor.java:250)
    at org.gradle.internal.operations.DefaultBuildOperationExecutor.execute(DefaultBuildOperationExecutor.java:158)
    at org.gradle.internal.operations.DefaultBuildOperationExecutor.call(DefaultBuildOperationExecutor.java:102)
    at org.gradle.internal.operations.DelegatingBuildOperationExecutor.call(DelegatingBuildOperationExecutor.java:36)
    at org.gradle.workers.internal.AbstractWorker.executeWrappedInBuildOperation(AbstractWorker.java:41)
    at org.gradle.workers.internal.NoIsolationWorkerFactory$1.execute(NoIsolationWorkerFactory.java:56)
    at org.gradle.workers.internal.DefaultWorkerExecutor$3.call(DefaultWorkerExecutor.java:215)
    at org.gradle.workers.internal.DefaultWorkerExecutor$3.call(DefaultWorkerExecutor.java:210)
    at java.util.concurrent.FutureTask.run(FutureTask.java:266)
    at org.gradle.internal.work.DefaultConditionalExecutionQueue$ExecutionRunner.runExecution(DefaultConditionalExecutionQueue.java:215)
    at org.gradle.internal.work.DefaultConditionalExecutionQueue$ExecutionRunner.runBatch(DefaultConditionalExecutionQueue.java:164)
    at org.gradle.internal.work.DefaultConditionalExecutionQueue$ExecutionRunner.run(DefaultConditionalExecutionQueue.java:131)
    at java.util.concurrent.Executors$RunnableAdapter.call(Executors.java:511)
    at java.util.concurrent.FutureTask.run(FutureTask.java:266)
    at org.gradle.internal.concurrent.ExecutorPolicy$CatchAndRecordFailures.onExecute(ExecutorPolicy.java:64)
    at org.gradle.internal.concurrent.ManagedExecutorImpl$1.run(ManagedExecutorImpl.java:48)
    at java.util.concurrent.ThreadPoolExecutor.runWorker(ThreadPoolExecutor.java:1149)
    at java.util.concurrent.ThreadPoolExecutor$Worker.run(ThreadPoolExecutor.java:624)
    at org.gradle.internal.concurrent.ThreadFactoryImpl$ManagedThreadRunnable.run(ThreadFactoryImpl.java:56)
    at java.lang.Thread.run(Thread.java:748)


FAILURE: Build failed with an exception.

* What went wrong:
Execution failed for task ':app:mergeExtDexDebug'.
> A failure occurred while executing com.android.build.gradle.internal.tasks.Workers$ActionFacade
   > java.nio.file.NoSuchFileException: /Users/tsudashouki/app-tv-app/build/app/intermediates/external_file_lib_dex_archives/debug/out

* Try:
Run with --stacktrace option to get the stack trace. Run with --info or --debug option to get more log output. Run with --scan to get full insights.

* Get more help at https://help.gradle.org

BUILD FAILED in 11s
Exception: Gradle task assembleDebug failed with exit code 1
-tv-app/build/app/intermediates/external_file_lib_dex_archives/debug/out

* Try:
Run with --stacktrace option to get the stack trace. Run with --info or --debug option to get more log output. Run with --scan to get full insights.

* Get more help at https://help.gradle.org

BUILD FAILED in 11s
Exception: Gradle task assembleDebug failed with exit code 1

やったこと

  1.   何のことか分からず、File->Project Structureに確認しにいくと以下の問題を見つけました
    イメージ説明
    似たようなエラーがここでも報告されていたので
    dart pub cache repair
    を実行し、もう一度ビルドしましたが結果は変わりませんでした。
    どなたか解決策をご存知ではないでしょうか?
  • 気になる質問をクリップする

    クリップした質問は、後からいつでもマイページで確認できます。

    またクリップした質問に回答があった際、通知やメールを受け取ることができます。

    クリップを取り消します

  • 良い質問の評価を上げる

    以下のような質問は評価を上げましょう

    • 質問内容が明確
    • 自分も答えを知りたい
    • 質問者以外のユーザにも役立つ

    評価が高い質問は、TOPページの「注目」タブのフィードに表示されやすくなります。

    質問の評価を上げたことを取り消します

  • 評価を下げられる数の上限に達しました

    評価を下げることができません

    • 1日5回まで評価を下げられます
    • 1日に1ユーザに対して2回まで評価を下げられます

    質問の評価を下げる

    teratailでは下記のような質問を「具体的に困っていることがない質問」、「サイトポリシーに違反する質問」と定義し、推奨していません。

    • プログラミングに関係のない質問
    • やってほしいことだけを記載した丸投げの質問
    • 問題・課題が含まれていない質問
    • 意図的に内容が抹消された質問
    • 過去に投稿した質問と同じ内容の質問
    • 広告と受け取られるような投稿

    評価が下がると、TOPページの「アクティブ」「注目」タブのフィードに表示されにくくなります。

    質問の評価を下げたことを取り消します

    この機能は開放されていません

    評価を下げる条件を満たしてません

    評価を下げる理由を選択してください

    詳細な説明はこちら

    上記に当てはまらず、質問内容が明確になっていない質問には「情報の追加・修正依頼」機能からコメントをしてください。

    質問の評価を下げる機能の利用条件

    この機能を利用するためには、以下の事項を行う必要があります。

まだ回答がついていません

15分調べてもわからないことは、teratailで質問しよう!

  • ただいまの回答率 87.48%
  • 質問をまとめることで、思考を整理して素早く解決
  • テンプレート機能で、簡単に質問をまとめられる

関連した質問

同じタグがついた質問を見る