質問をすることでしか得られない、回答やアドバイスがある。

15分調べてもわからないことは、質問しよう!

ただいまの
回答率

87.78%

Laravel6系でログイン機能作成時にnpm run devが上手くいかない

解決済

回答 1

投稿 編集

  • 評価
  • クリップ 1
  • VIEW 878

score 8

前提・実現したいこと

こちらの記事を参考にLaravelでログイン機能を作成しようとしています。
参考記事

その際のこちらをdockerのコンテナ内で実行したのですが以下のエラーが発生し、状況、解決方法が分からない状態になっています。

$ npm run dev

発生している問題・エラーメッセージ

> @ dev /var/www/html/[project-name]
> npm run development


> @ development /var/www/html/[project-name]
> cross-env NODE_ENV=development node_modules/webpack/bin/webpack.js --progress --hide-modules --config=node_modules/laravel-mix/setup/webpack.config.js

98% after emitting SizeLimitsPlugin

 ERROR  Failed to compile with 2 errors                                                                                                                                                                                                            12:24:13 PM

 error  in ./resources/sass/app.scss

Module build failed (from ./node_modules/css-loader/index.js):
ModuleBuildError: Module build failed (from ./node_modules/sass-loader/dist/cjs.js):
ValidationError: Invalid options object. Sass Loader has been initialized using an options object that does not match the API schema.
 - options has an unknown property 'outputStyle'. These properties are valid:
   object { implementation?, sassOptions?, prependData?, sourceMap?, webpackImporter? }
    at validate (/var/www/html/[project-name]/node_modules/sass-loader/node_modules/schema-utils/dist/validate.js:85:11)
    at Object.loader (/var/www/html/[project-name]/node_modules/sass-loader/dist/index.js:36:28)
    at runLoaders (/var/www/html/[project-name]/node_modules/webpack/lib/NormalModule.js:316:20)
    at /var/www/html/[project-name]/node_modules/loader-runner/lib/LoaderRunner.js:367:11
    at /var/www/html/[project-name]/node_modules/loader-runner/lib/LoaderRunner.js:233:18
    at runSyncOrAsync (/var/www/html/[project-name]/node_modules/loader-runner/lib/LoaderRunner.js:143:3)
    at iterateNormalLoaders (/var/www/html/[project-name]/node_modules/loader-runner/lib/LoaderRunner.js:232:2)
    at /var/www/html/[project-name]/node_modules/loader-runner/lib/LoaderRunner.js:205:4
    at process.nextTick (/var/www/html/[project-name]/node_modules/enhanced-resolve/lib/CachedInputFileSystem.js:85:15)
    at process._tickCallback (internal/process/next_tick.js:61:11)

 error  in ./resources/sass/app.scss

Module build failed (from ./node_modules/sass-loader/dist/cjs.js):
ValidationError: Invalid options object. Sass Loader has been initialized using an options object that does not match the API schema.
 - options has an unknown property 'outputStyle'. These properties are valid:
   object { implementation?, sassOptions?, prependData?, sourceMap?, webpackImporter? }
    at validate (/var/www/html/[project-name]/node_modules/sass-loader/node_modules/schema-utils/dist/validate.js:85:11)
    at Object.loader (/var/www/html/[project-name]/node_modules/sass-loader/dist/index.js:36:28)

 @ ./resources/sass/app.scss 2:14-253

     Asset      Size   Chunks             Chunk Names
/js/app.js  1.39 MiB  /js/app  [emitted]  /js/app

ERROR in ./resources/sass/app.scss
Module build failed (from ./node_modules/css-loader/index.js):
ModuleBuildError: Module build failed (from ./node_modules/sass-loader/dist/cjs.js):
ValidationError: Invalid options object. Sass Loader has been initialized using an options object that does not match the API schema.
 - options has an unknown property 'outputStyle'. These properties are valid:
   object { implementation?, sassOptions?, prependData?, sourceMap?, webpackImporter? }
    at validate (/var/www/html/[project-name]/node_modules/sass-loader/node_modules/schema-utils/dist/validate.js:85:11)
    at Object.loader (/var/www/html/[project-name]/node_modules/sass-loader/dist/index.js:36:28)
    at runLoaders (/var/www/html/[project-name]/node_modules/webpack/lib/NormalModule.js:316:20)
    at /var/www/html/[project-name]/node_modules/loader-runner/lib/LoaderRunner.js:367:11
    at /var/www/html/[project-name]/node_modules/loader-runner/lib/LoaderRunner.js:233:18
    at runSyncOrAsync (/var/www/html/[project-name]/node_modules/loader-runner/lib/LoaderRunner.js:143:3)
    at iterateNormalLoaders (/var/www/html/[project-name]/node_modules/loader-runner/lib/LoaderRunner.js:232:2)
    at /var/www/html/[project-name]/node_modules/loader-runner/lib/LoaderRunner.js:205:4
    at process.nextTick (/var/www/html/[project-name]/node_modules/enhanced-resolve/lib/CachedInputFileSystem.js:85:15)
    at process._tickCallback (internal/process/next_tick.js:61:11)
 @ ./resources/sass/app.scss

ERROR in ./resources/sass/app.scss (./node_modules/css-loader??ref--5-2!./node_modules/postcss-loader/src??postcss0!./node_modules/resolve-url-loader??ref--5-4!./node_modules/sass-loader/dist/cjs.js??ref--5-5!./resources/sass/app.scss)
Module build failed (from ./node_modules/sass-loader/dist/cjs.js):
ValidationError: Invalid options object. Sass Loader has been initialized using an options object that does not match the API schema.
 - options has an unknown property 'outputStyle'. These properties are valid:
   object { implementation?, sassOptions?, prependData?, sourceMap?, webpackImporter? }
    at validate (/var/www/html/[project-name]/node_modules/sass-loader/node_modules/schema-utils/dist/validate.js:85:11)
    at Object.loader (/var/www/html/[project-name]/node_modules/sass-loader/dist/index.js:36:28)
 @ ./resources/sass/app.scss 2:14-253
npm ERR! code ELIFECYCLE
npm ERR! errno 2
npm ERR! @ development: `cross-env NODE_ENV=development node_modules/webpack/bin/webpack.js --progress --hide-modules --config=node_modules/laravel-mix/setup/webpack.config.js`
npm ERR! Exit status 2
npm ERR!
npm ERR! Failed at the @ development script.
npm ERR! This is probably not a problem with npm. There is likely additional logging output above.

npm ERR! A complete log of this run can be found in:
npm ERR!     /root/.npm/_logs/2020-03-06T12_24_13_191Z-debug.log
npm ERR! code ELIFECYCLE
npm ERR! errno 2
npm ERR! @ dev: `npm run development`
npm ERR! Exit status 2
npm ERR!
npm ERR! Failed at the @ dev script.
npm ERR! This is probably not a problem with npm. There is likely additional logging output above.

npm ERR! A complete log of this run can be found in:
npm ERR!     /root/.npm/_logs/2020-03-06T12_24_13_212Z-debug.log

初めての投稿で不足している情報などもあるかと思いますが追記しますので、よろしくお願いします。

補足情報(FW/ツールのバージョンなど)

Docker
Laravel version 6.18.0
node.js version 10.18.1

  • 気になる質問をクリップする

    クリップした質問は、後からいつでもマイページで確認できます。

    またクリップした質問に回答があった際、通知やメールを受け取ることができます。

    クリップを取り消します

  • 良い質問の評価を上げる

    以下のような質問は評価を上げましょう

    • 質問内容が明確
    • 自分も答えを知りたい
    • 質問者以外のユーザにも役立つ

    評価が高い質問は、TOPページの「注目」タブのフィードに表示されやすくなります。

    質問の評価を上げたことを取り消します

  • 評価を下げられる数の上限に達しました

    評価を下げることができません

    • 1日5回まで評価を下げられます
    • 1日に1ユーザに対して2回まで評価を下げられます

    質問の評価を下げる

    teratailでは下記のような質問を「具体的に困っていることがない質問」、「サイトポリシーに違反する質問」と定義し、推奨していません。

    • プログラミングに関係のない質問
    • やってほしいことだけを記載した丸投げの質問
    • 問題・課題が含まれていない質問
    • 意図的に内容が抹消された質問
    • 過去に投稿した質問と同じ内容の質問
    • 広告と受け取られるような投稿

    評価が下がると、TOPページの「アクティブ」「注目」タブのフィードに表示されにくくなります。

    質問の評価を下げたことを取り消します

    この機能は開放されていません

    評価を下げる条件を満たしてません

    評価を下げる理由を選択してください

    詳細な説明はこちら

    上記に当てはまらず、質問内容が明確になっていない質問には「情報の追加・修正依頼」機能からコメントをしてください。

    質問の評価を下げる機能の利用条件

    この機能を利用するためには、以下の事項を行う必要があります。

回答 1

checkベストアンサー

+1

おそらくこちらと同じエラーかと思います。

Laravel6でVueを使おうとnpm run watchをするとエラーが出る

投稿

  • 回答の評価を上げる

    以下のような回答は評価を上げましょう

    • 正しい回答
    • わかりやすい回答
    • ためになる回答

    評価が高い回答ほどページの上位に表示されます。

  • 回答の評価を下げる

    下記のような回答は推奨されていません。

    • 間違っている回答
    • 質問の回答になっていない投稿
    • スパムや攻撃的な表現を用いた投稿

    評価を下げる際はその理由を明確に伝え、適切な回答に修正してもらいましょう。

  • 2020/03/07 12:18

    ありがとうございます!解決しました!

    キャンセル

15分調べてもわからないことは、teratailで質問しよう!

  • ただいまの回答率 87.78%
  • 質問をまとめることで、思考を整理して素早く解決
  • テンプレート機能で、簡単に質問をまとめられる

関連した質問

同じタグがついた質問を見る