質問編集履歴

3 書式の改善

cheeeeeeese

cheeeeeeese score 155

2015/08/21 23:51  投稿

Atomにターミナルをインストールできない。
皆様、質問がございます。
Atomでターミナルを操作したいと思い下記のコマンドを入力しました。
結果、npmエラーなどが生じてしまいました。
https://github.com/atom-archive/terminal/issues/28
上記サイトを見て対処しようと試みたり、stackoverfrowで同じ問題に対する解決方法をさがしたのですが、どうしても解決できません。
エラーの対象方法をお教え頂ければと思います。
宜しくお願い致します。
```
$ apm install term2
Installing term2 to /User/.atom/packages ✗
> pty.js@0.2.13 install /private/var/folders/bh/qqktv0_n49vc585f8dn7hq600000gn/T/apm-install-dir-115721-23811-m9y2he/node_modules/term2/node_modules/pty.js
> node-gyp rebuild
 CXX(target) Release/obj.target/pty/src/unix/pty.o
 SOLINK_MODULE(target) Release/pty.node
ld: library not found for -lgcc_s.10.5
clang: error: linker command failed with exit code 1 (use -v to see invocation)
make: *** [Release/pty.node] Error 1
gyp ERR! build error
gyp ERR! stack Error: `make` failed with exit code: 2
gyp ERR! stack    at ChildProcess.onExit (/Users/tomokitakahashi/Downloads/Atom.app/Contents/Resources/app/apm/node_modules/npm/node_modules/node-gyp/lib/build.js:267:23)
gyp ERR! stack    at ChildProcess.onExit (/Users/Downloads/Atom.app/Contents/Resources/app/apm/node_modules/npm/node_modules/node-gyp/lib/build.js:267:23)
gyp ERR! stack    at ChildProcess.emit (events.js:98:17)
gyp ERR! stack    at Process.ChildProcess._handle.onexit (child_process.js:820:12)
gyp ERR! System Darwin 14.4.0
gyp ERR! command "node" "/Users/Downloads/Atom.app/Contents/Resources/app/apm/node_modules/npm/node_modules/node-gyp/bin/node-gyp.js" "rebuild"
gyp ERR! cwd /private/var/folders/bh/qqktv0_n49vc585f8dn7hq600000gn/T/apm-install-dir-115721-23811-m9y2he/node_modules/term2/node_modules/pty.js
gyp ERR! node -v v0.10.35
gyp ERR! node-gyp -v v1.0.2
gyp ERR! not ok
npm ERR! Darwin 14.4.0
npm ERR! argv "/Users//Downloads/Atom.app/Contents/Resources/app/apm/bin/node" "/Users/Downloads/Atom.app/Contents/Resources/app/apm/node_modules/npm/bin/npm-cli.js" "--globalconfig" "/Users//.atom/.apm/.apmrc" "--userconfig" "/Users//.atom/.apmrc" "install" "/private/var/folders/bh/qqktv0_n49vc585f8dn7hq600000gn/T/d-115721-23811-j9f77o/package.tgz" "--target=0.22.0" "--arch=x64"
npm ERR! node v0.10.35
npm ERR! npm v2.5.1
npm ERR! code ELIFECYCLE
npm ERR! pty.js@0.2.13 install: `node-gyp rebuild`
npm ERR! Exit status 1
npm ERR!
npm ERR! Failed at the pty.js@0.2.13 install script 'node-gyp rebuild'.
npm ERR! This is most likely a problem with the pty.js package,
npm ERR! not with npm itself.
npm ERR! Tell the author that this fails on your system:
npm ERR!    node-gyp rebuild
npm ERR! You can get their info via:
npm ERR!    npm owner ls pty.js
npm ERR! There is likely additional logging output above.
npm ERR! Please include the following file with any support request:
npm ERR!    /private/var/folders/bh/qqktv0_n49vc585f8dn7hq600000gn/T/apm-install-dir-115721-23811-m9y2he/npm-debug.log
```
2 誤字の修正

cheeeeeeese

cheeeeeeese score 155

2015/08/21 23:50  投稿

Atomにターミナルをインストールできない。
皆様、質問がございます。
Atomでターミナルを操作したいと思い下記のコマンドを入力しました。
結果、npmエラーなどが生じてしまいました。
https://github.com/atom-archive/terminal/issues/28
上記サイトを見て対処しようと試みたり、stackoverfrowで同じ問題に対する解決方法をさがしたのですが、どうしても解決できません。
エラーの対象方法をお教え頂ければと思います。
宜しくお願い致します。
```
$ apm install term2
Installing term2 to /Users/tomokitakahashi/.atom/packages ✗
Installing term2 to /User/.atom/packages ✗
> pty.js@0.2.13 install /private/var/folders/bh/qqktv0_n49vc585f8dn7hq600000gn/T/apm-install-dir-115721-23811-m9y2he/node_modules/term2/node_modules/pty.js
> node-gyp rebuild
 CXX(target) Release/obj.target/pty/src/unix/pty.o
 SOLINK_MODULE(target) Release/pty.node
ld: library not found for -lgcc_s.10.5
clang: error: linker command failed with exit code 1 (use -v to see invocation)
make: *** [Release/pty.node] Error 1
gyp ERR! build error
gyp ERR! stack Error: `make` failed with exit code: 2
gyp ERR! stack    at ChildProcess.onExit (/Users/tomokitakahashi/Downloads/Atom.app/Contents/Resources/app/apm/node_modules/npm/node_modules/node-gyp/lib/build.js:267:23)
gyp ERR! stack    at ChildProcess.emit (events.js:98:17)
gyp ERR! stack    at Process.ChildProcess._handle.onexit (child_process.js:820:12)
gyp ERR! System Darwin 14.4.0
gyp ERR! command "node" "/Users/Downloads/Atom.app/Contents/Resources/app/apm/node_modules/npm/node_modules/node-gyp/bin/node-gyp.js" "rebuild"
gyp ERR! cwd /private/var/folders/bh/qqktv0_n49vc585f8dn7hq600000gn/T/apm-install-dir-115721-23811-m9y2he/node_modules/term2/node_modules/pty.js
gyp ERR! node -v v0.10.35
gyp ERR! node-gyp -v v1.0.2
gyp ERR! not ok
npm ERR! Darwin 14.4.0
npm ERR! argv "/Users//Downloads/Atom.app/Contents/Resources/app/apm/bin/node" "/Users/Downloads/Atom.app/Contents/Resources/app/apm/node_modules/npm/bin/npm-cli.js" "--globalconfig" "/Users//.atom/.apm/.apmrc" "--userconfig" "/Users//.atom/.apmrc" "install" "/private/var/folders/bh/qqktv0_n49vc585f8dn7hq600000gn/T/d-115721-23811-j9f77o/package.tgz" "--target=0.22.0" "--arch=x64"
npm ERR! node v0.10.35
npm ERR! npm v2.5.1
npm ERR! code ELIFECYCLE
npm ERR! pty.js@0.2.13 install: `node-gyp rebuild`
npm ERR! Exit status 1
npm ERR!
npm ERR! Failed at the pty.js@0.2.13 install script 'node-gyp rebuild'.
npm ERR! This is most likely a problem with the pty.js package,
npm ERR! not with npm itself.
npm ERR! Tell the author that this fails on your system:
npm ERR!    node-gyp rebuild
npm ERR! You can get their info via:
npm ERR!    npm owner ls pty.js
npm ERR! There is likely additional logging output above.
npm ERR! Please include the following file with any support request:
npm ERR!    /private/var/folders/bh/qqktv0_n49vc585f8dn7hq600000gn/T/apm-install-dir-115721-23811-m9y2he/npm-debug.log
```
1 誤字の修正

cheeeeeeese

cheeeeeeese score 155

2015/08/21 23:50  投稿

Atomにターミナルをインストールできない。
皆様、質問がございます。
Atomでターミナルを操作したいと思い下記のコマンドを入力しました。
結果、npmエラーなどが生じてしまいました。
https://github.com/atom-archive/terminal/issues/28
上記サイトを見て対処しようと試みたり、stackoverfrowで同じ問題に対する解決方法をさがしたのですが、どうしても解決できません。
エラーの対象方法をお教え頂ければと思います。
宜しくお願い致します。
```
$ apm install term2
Installing term2 to /Users/tomokitakahashi/.atom/packages ✗
> pty.js@0.2.13 install /private/var/folders/bh/qqktv0_n49vc585f8dn7hq600000gn/T/apm-install-dir-115721-23811-m9y2he/node_modules/term2/node_modules/pty.js
> node-gyp rebuild
 CXX(target) Release/obj.target/pty/src/unix/pty.o
 SOLINK_MODULE(target) Release/pty.node
ld: library not found for -lgcc_s.10.5
clang: error: linker command failed with exit code 1 (use -v to see invocation)
make: *** [Release/pty.node] Error 1
gyp ERR! build error
gyp ERR! stack Error: `make` failed with exit code: 2
gyp ERR! stack    at ChildProcess.onExit (/Users/tomokitakahashi/Downloads/Atom.app/Contents/Resources/app/apm/node_modules/npm/node_modules/node-gyp/lib/build.js:267:23)
gyp ERR! stack    at ChildProcess.emit (events.js:98:17)
gyp ERR! stack    at Process.ChildProcess._handle.onexit (child_process.js:820:12)
gyp ERR! System Darwin 14.4.0
gyp ERR! command "node" "/Users/tomokitakahashi/Downloads/Atom.app/Contents/Resources/app/apm/node_modules/npm/node_modules/node-gyp/bin/node-gyp.js" "rebuild"
gyp ERR! command "node" "/Users/Downloads/Atom.app/Contents/Resources/app/apm/node_modules/npm/node_modules/node-gyp/bin/node-gyp.js" "rebuild"
gyp ERR! cwd /private/var/folders/bh/qqktv0_n49vc585f8dn7hq600000gn/T/apm-install-dir-115721-23811-m9y2he/node_modules/term2/node_modules/pty.js
gyp ERR! node -v v0.10.35
gyp ERR! node-gyp -v v1.0.2
gyp ERR! not ok
npm ERR! Darwin 14.4.0
npm ERR! argv "/Users/tomokitakahashi/Downloads/Atom.app/Contents/Resources/app/apm/bin/node" "/Users/tomokitakahashi/Downloads/Atom.app/Contents/Resources/app/apm/node_modules/npm/bin/npm-cli.js" "--globalconfig" "/Users/tomokitakahashi/.atom/.apm/.apmrc" "--userconfig" "/Users/tomokitakahashi/.atom/.apmrc" "install" "/private/var/folders/bh/qqktv0_n49vc585f8dn7hq600000gn/T/d-115721-23811-j9f77o/package.tgz" "--target=0.22.0" "--arch=x64"
npm ERR! argv "/Users//Downloads/Atom.app/Contents/Resources/app/apm/bin/node" "/Users/Downloads/Atom.app/Contents/Resources/app/apm/node_modules/npm/bin/npm-cli.js" "--globalconfig" "/Users//.atom/.apm/.apmrc" "--userconfig" "/Users//.atom/.apmrc" "install" "/private/var/folders/bh/qqktv0_n49vc585f8dn7hq600000gn/T/d-115721-23811-j9f77o/package.tgz" "--target=0.22.0" "--arch=x64"
npm ERR! node v0.10.35
npm ERR! npm v2.5.1
npm ERR! code ELIFECYCLE
npm ERR! pty.js@0.2.13 install: `node-gyp rebuild`
npm ERR! Exit status 1
npm ERR!
npm ERR! Failed at the pty.js@0.2.13 install script 'node-gyp rebuild'.
npm ERR! This is most likely a problem with the pty.js package,
npm ERR! not with npm itself.
npm ERR! Tell the author that this fails on your system:
npm ERR!    node-gyp rebuild
npm ERR! You can get their info via:
npm ERR!    npm owner ls pty.js
npm ERR! There is likely additional logging output above.
npm ERR! Please include the following file with any support request:
npm ERR!    /private/var/folders/bh/qqktv0_n49vc585f8dn7hq600000gn/T/apm-install-dir-115721-23811-m9y2he/npm-debug.log
```

思考するエンジニアのためのQ&Aサイト「teratail」について詳しく知る