質問をすることでしか得られない、回答やアドバイスがある。

15分調べてもわからないことは、質問しよう!

ただいまの
回答率

90.43%

  • Java

    14775questions

    Javaは、1995年にサン・マイクロシステムズが開発したプログラミング言語です。表記法はC言語に似ていますが、既存のプログラミング言語の短所を踏まえていちから設計されており、最初からオブジェクト指向性を備えてデザインされています。セキュリティ面が強力であることや、ネットワーク環境での利用に向いていることが特徴です。Javaで作られたソフトウェアは基本的にいかなるプラットフォームでも作動します。

  • Spring

    753questions

    Spring Framework は、Javaプラットフォーム向けのオープンソースアプリケーションフレームワークです。 Java Platform上に、 Web ベースのアプリケーションを設計するための拡張機能が数多く用意されています。

  • Java EE

    392questions

    Java EE(Java Enterprise Edition)はJavaベースのテクノロジーとその相互運用の仕様をまとめたものです。サーバとクライアントのアーキテクチャを規定し、特定アプリケーションのクラス用に定義されたテクノロジー設定のプロファイルを使用します。

Spring用IDE、STSの環境構築について

受付中

回答 1

投稿

  • 評価
  • クリップ 1
  • VIEW 1,231

LokiTick

score 19

前提・実現したいこと

STSの開発環境を整えたい。

発生している問題・エラーメッセージ

STSで新規プロジェクトを作った際のmaven installが正常に完了しない。

[INFO] Scanning for projects...
[INFO]                                                                         
[INFO] ------------------------------------------------------------------------
[INFO] Building TestWebApp 0.0.1-SNAPSHOT
[INFO] ------------------------------------------------------------------------
[INFO] 
[INFO] --- maven-resources-plugin:2.6:resources (default-resources) @ TestWebApp ---
[INFO] Using 'UTF-8' encoding to copy filtered resources.
[INFO] Copying 2 resources
[INFO] 
[INFO] --- maven-compiler-plugin:3.1:compile (default-compile) @ TestWebApp ---
[INFO] Nothing to compile - all classes are up to date
[INFO] 
[INFO] --- maven-resources-plugin:2.6:testResources (default-testResources) @ TestWebApp ---
[INFO] Using 'UTF-8' encoding to copy filtered resources.
[INFO] skip non existing resourceDirectory C:\Users\own\Documents\workspace-sts-3.9.0.RELEASE\TestWebApp\src\test\resources
[INFO] 
[INFO] --- maven-compiler-plugin:3.1:testCompile (default-testCompile) @ TestWebApp ---
[INFO] Nothing to compile - all classes are up to date
[INFO] 
[INFO] --- maven-surefire-plugin:2.12.4:test (default-test) @ TestWebApp ---
[INFO] 
[INFO] --- maven-war-plugin:2.2:war (default-war) @ TestWebApp ---
[WARNING] Error injecting: org.apache.maven.plugin.war.WarMojo
java.lang.TypeNotPresentException: Type org.apache.maven.plugin.war.WarMojo not present
    at org.eclipse.sisu.space.URLClassSpace.loadClass(URLClassSpace.java:143)
    at org.eclipse.sisu.space.NamedClass.load(NamedClass.java:46)
    at org.eclipse.sisu.space.AbstractDeferredClass.get(AbstractDeferredClass.java:48)
    at com.google.inject.internal.ProviderInternalFactory.provision(ProviderInternalFactory.java:81)
    at com.google.inject.internal.InternalFactoryToInitializableAdapter.provision(InternalFactoryToInitializableAdapter.java:53)
    at com.google.inject.internal.ProviderInternalFactory$1.call(ProviderInternalFactory.java:65)
    at com.google.inject.internal.ProvisionListenerStackCallback$Provision.provision(ProvisionListenerStackCallback.java:115)
    at org.eclipse.sisu.bean.BeanScheduler$Activator.onProvision(BeanScheduler.java:176)
    at com.google.inject.internal.ProvisionListenerStackCallback$Provision.provision(ProvisionListenerStackCallback.java:126)
    at com.google.inject.internal.ProvisionListenerStackCallback.provision(ProvisionListenerStackCallback.java:68)
    at com.google.inject.internal.ProviderInternalFactory.circularGet(ProviderInternalFactory.java:63)
    at com.google.inject.internal.InternalFactoryToInitializableAdapter.get(InternalFactoryToInitializableAdapter.java:45)
    at com.google.inject.internal.InjectorImpl$2$1.call(InjectorImpl.java:1016)
    at com.google.inject.internal.InjectorImpl.callInContext(InjectorImpl.java:1092)
    at com.google.inject.internal.InjectorImpl$2.get(InjectorImpl.java:1012)
    at org.eclipse.sisu.inject.Guice4$1.get(Guice4.java:162)
    at org.eclipse.sisu.inject.LazyBeanEntry.getValue(LazyBeanEntry.java:81)
    at org.eclipse.sisu.plexus.LazyPlexusBean.getValue(LazyPlexusBean.java:51)
    at org.codehaus.plexus.DefaultPlexusContainer.lookup(DefaultPlexusContainer.java:263)
    at org.codehaus.plexus.DefaultPlexusContainer.lookup(DefaultPlexusContainer.java:255)
    at org.apache.maven.plugin.internal.DefaultMavenPluginManager.getConfiguredMojo(DefaultMavenPluginManager.java:517)
    at org.apache.maven.plugin.DefaultBuildPluginManager.executeMojo(DefaultBuildPluginManager.java:121)
    at org.apache.maven.lifecycle.internal.MojoExecutor.execute(MojoExecutor.java:207)
    at org.apache.maven.lifecycle.internal.MojoExecutor.execute(MojoExecutor.java:153)
    at org.apache.maven.lifecycle.internal.MojoExecutor.execute(MojoExecutor.java:145)
    at org.apache.maven.lifecycle.internal.LifecycleModuleBuilder.buildProject(LifecycleModuleBuilder.java:116)
    at org.apache.maven.lifecycle.internal.LifecycleModuleBuilder.buildProject(LifecycleModuleBuilder.java:80)
    at org.apache.maven.lifecycle.internal.builder.singlethreaded.SingleThreadedBuilder.build(SingleThreadedBuilder.java:51)
    at org.apache.maven.lifecycle.internal.LifecycleStarter.execute(LifecycleStarter.java:128)
    at org.apache.maven.DefaultMaven.doExecute(DefaultMaven.java:307)
    at org.apache.maven.DefaultMaven.doExecute(DefaultMaven.java:193)
    at org.apache.maven.DefaultMaven.execute(DefaultMaven.java:106)
    at org.apache.maven.cli.MavenCli.execute(MavenCli.java:863)
    at org.apache.maven.cli.MavenCli.doMain(MavenCli.java:288)
    at org.apache.maven.cli.MavenCli.main(MavenCli.java:199)
    at sun.reflect.NativeMethodAccessorImpl.invoke0(Native Method)
    at sun.reflect.NativeMethodAccessorImpl.invoke(Unknown Source)
    at sun.reflect.DelegatingMethodAccessorImpl.invoke(Unknown Source)
    at java.lang.reflect.Method.invoke(Unknown Source)
    at org.codehaus.plexus.classworlds.launcher.Launcher.launchEnhanced(Launcher.java:289)
    at org.codehaus.plexus.classworlds.launcher.Launcher.launch(Launcher.java:229)
    at org.codehaus.plexus.classworlds.launcher.Launcher.mainWithExitCode(Launcher.java:415)
    at org.codehaus.plexus.classworlds.launcher.Launcher.main(Launcher.java:356)
Caused by: java.lang.ClassNotFoundException: org.apache.maven.plugin.war.WarMojo
    at org.codehaus.plexus.classworlds.strategy.SelfFirstStrategy.loadClass(SelfFirstStrategy.java:50)
    at org.codehaus.plexus.classworlds.realm.ClassRealm.unsynchronizedLoadClass(ClassRealm.java:271)
    at org.codehaus.plexus.classworlds.realm.ClassRealm.loadClass(ClassRealm.java:247)
    at org.codehaus.plexus.classworlds.realm.ClassRealm.loadClass(ClassRealm.java:239)
    at org.eclipse.sisu.space.URLClassSpace.loadClass(URLClassSpace.java:139)
    ... 42 more
[INFO] ------------------------------------------------------------------------
[INFO] BUILD FAILURE
[INFO] ------------------------------------------------------------------------
[INFO] Total time: 1.568 s
[INFO] Finished at: 2017-08-17T21:20:39+09:00
[INFO] Final Memory: 13M/114M
[INFO] ------------------------------------------------------------------------
[ERROR] Failed to execute goal org.apache.maven.plugins:maven-war-plugin:2.2:war (default-war) on project TestWebApp: Execution default-war of goal org.apache.maven.plugins:maven-war-plugin:2.2:war failed: Unable to load the mojo 'war' in the plugin 'org.apache.maven.plugins:maven-war-plugin:2.2'. A required class is missing: org.apache.maven.plugin.war.WarMojo
[ERROR] -----------------------------------------------------
[ERROR] realm =    plugin>org.apache.maven.plugins:maven-war-plugin:2.2
[ERROR] strategy = org.codehaus.plexus.classworlds.strategy.SelfFirstStrategy
[ERROR] urls[0] = file:/C:/Users/own/.m2/repository/org/apache/maven/plugins/maven-war-plugin/2.2/maven-war-plugin-2.2.jar
[ERROR] urls[1] = file:/C:/Users/own/.m2/repository/org/apache/maven/reporting/maven-reporting-api/2.0.6/maven-reporting-api-2.0.6.jar
[ERROR] urls[2] = file:/C:/Users/own/.m2/repository/org/apache/maven/doxia/doxia-sink-api/1.0-alpha-7/doxia-sink-api-1.0-alpha-7.jar
[ERROR] urls[3] = file:/C:/Users/own/.m2/repository/commons-cli/commons-cli/1.0/commons-cli-1.0.jar
[ERROR] urls[4] = file:/C:/Users/own/.m2/repository/org/codehaus/plexus/plexus-interactivity-api/1.0-alpha-4/plexus-interactivity-api-1.0-alpha-4.jar
[ERROR] urls[5] = file:/C:/Users/own/.m2/repository/org/apache/maven/maven-archiver/2.5/maven-archiver-2.5.jar
[ERROR] urls[6] = file:/C:/Users/own/.m2/repository/org/codehaus/plexus/plexus-io/2.0.2/plexus-io-2.0.2.jar
[ERROR] urls[7] = file:/C:/Users/own/.m2/repository/org/codehaus/plexus/plexus-archiver/2.1/plexus-archiver-2.1.jar
[ERROR] urls[8] = file:/C:/Users/own/.m2/repository/org/codehaus/plexus/plexus-interpolation/1.15/plexus-interpolation-1.15.jar
[ERROR] urls[9] = file:/C:/Users/own/.m2/repository/junit/junit/3.8.1/junit-3.8.1.jar
[ERROR] urls[10] = file:/C:/Users/own/.m2/repository/com/thoughtworks/xstream/xstream/1.3.1/xstream-1.3.1.jar
[ERROR] urls[11] = file:/C:/Users/own/.m2/repository/xpp3/xpp3_min/1.1.4c/xpp3_min-1.1.4c.jar
[ERROR] urls[12] = file:/C:/Users/own/.m2/repository/org/codehaus/plexus/plexus-utils/3.0/plexus-utils-3.0.jar
[ERROR] urls[13] = file:/C:/Users/own/.m2/repository/org/apache/maven/shared/maven-filtering/1.0-beta-2/maven-filtering-1.0-beta-2.jar
[ERROR] Number of foreign imports: 1
[ERROR] import: Entry[import  from realm ClassRealm[maven.api, parent: null]]
[ERROR] 
[ERROR] -----------------------------------------------------
[ERROR] -> [Help 1]
[ERROR] 
[ERROR] To see the full stack trace of the errors, re-run Maven with the -e switch.
[ERROR] Re-run Maven using the -X switch to enable full debug logging.
[ERROR] 
[ERROR] For more information about the errors and possible solutions, please read the following articles:
[ERROR] [Help 1] http://cwiki.apache.org/confluence/display/MAVEN/PluginContainerException

試したこと

投稿前はproxiyに関するエラー表記もありましたが
settings.xmlの見直しで消えました。

補足情報(言語/FW/ツール等のバージョンなど)

sts3.90 jdk1.8

  • 気になる質問をクリップする

    クリップした質問は、後からいつでもマイページで確認できます。

    またクリップした質問に回答があった際、通知やメールを受け取ることができます。

    クリップを取り消します

  • 良い質問の評価を上げる

    以下のような質問は評価を上げましょう

    • 質問内容が明確
    • 自分も答えを知りたい
    • 質問者以外のユーザにも役立つ

    評価が高い質問は、TOPページの「注目」タブのフィードに表示されやすくなります。

    質問の評価を上げたことを取り消します

  • 評価を下げられる数の上限に達しました

    評価を下げることができません

    • 1日5回まで評価を下げられます
    • 1日に1ユーザに対して2回まで評価を下げられます

    質問の評価を下げる

    teratailでは下記のような質問を「具体的に困っていることがない質問」、「サイトポリシーに違反する質問」と定義し、推奨していません。

    • プログラミングに関係のない質問
    • やってほしいことだけを記載した丸投げの質問
    • 問題・課題が含まれていない質問
    • 意図的に内容が抹消された質問
    • 広告と受け取られるような投稿

    評価が下がると、TOPページの「アクティブ」「注目」タブのフィードに表示されにくくなります。

    質問の評価を下げたことを取り消します

    この機能は開放されていません

    評価を下げる条件を満たしてません

    評価を下げる理由を選択してください

    詳細な説明はこちら

    上記に当てはまらず、質問内容が明確になっていない質問には「情報の追加・修正依頼」機能からコメントをしてください。

    質問の評価を下げる機能の利用条件

    この機能を利用するためには、以下の事項を行う必要があります。

回答 1

0

あくまで可能性の1つですが、maven経由でローカルリポジトリないしなmavenのプロファイルで設定しているリポジトリにダウンロードされているmaven-war-plugin-2.2.jarが破損している恐れがあります。

エラーとなっている当該クラスは maven-war-plugin-2.2.jarには含まれていますので、何らかの原因で破損ないしは解凍できない状態になっている場合があります。

ローカルリポジトリであれば、.m2/repository/org/apache/maven/plugin/ にある maven-war-plugin ディレクトリごと削除した後、mvn clean install をすると再度ダウンロード→ビルドを試行します。

投稿

  • 回答の評価を上げる

    以下のような回答は評価を上げましょう

    • 正しい回答
    • わかりやすい回答
    • ためになる回答

    評価が高い回答ほどページの上位に表示されます。

  • 回答の評価を下げる

    下記のような回答は推奨されていません。

    • 間違っている回答
    • 質問の回答になっていない投稿
    • スパムや攻撃的な表現を用いた投稿

    評価を下げる際はその理由を明確に伝え、適切な回答に修正してもらいましょう。

  • 2017/08/22 13:27

    遅くなり申し訳ありません、上記の内容を実行しましたが、解決に至りませんでした。
    ただエラーをよく読み、解決できるようもう少し頑張ってみます

    キャンセル

15分調べてもわからないことは、teratailで質問しよう!

  • ただいまの回答率 90.43%
  • 質問をまとめることで、思考を整理して素早く解決
  • テンプレート機能で、簡単に質問をまとめられる

同じタグがついた質問を見る

  • Java

    14775questions

    Javaは、1995年にサン・マイクロシステムズが開発したプログラミング言語です。表記法はC言語に似ていますが、既存のプログラミング言語の短所を踏まえていちから設計されており、最初からオブジェクト指向性を備えてデザインされています。セキュリティ面が強力であることや、ネットワーク環境での利用に向いていることが特徴です。Javaで作られたソフトウェアは基本的にいかなるプラットフォームでも作動します。

  • Spring

    753questions

    Spring Framework は、Javaプラットフォーム向けのオープンソースアプリケーションフレームワークです。 Java Platform上に、 Web ベースのアプリケーションを設計するための拡張機能が数多く用意されています。

  • Java EE

    392questions

    Java EE(Java Enterprise Edition)はJavaベースのテクノロジーとその相互運用の仕様をまとめたものです。サーバとクライアントのアーキテクチャを規定し、特定アプリケーションのクラス用に定義されたテクノロジー設定のプロファイルを使用します。