質問をすることでしか得られない、回答やアドバイスがある。

15分調べてもわからないことは、質問しよう!

ただいまの
回答率

90.35%

  • Linux

    4680questions

    Linuxは、Unixをベースにして開発されたオペレーティングシステムです。日本では「リナックス」と呼ばれています。 主にWebサーバやDNSサーバ、イントラネットなどのサーバ用OSとして利用されています。 上位500のスーパーコンピュータの90%以上はLinuxを使用しています。 携帯端末用のプラットフォームAndroidは、Linuxカーネル上に構築されています。

  • CentOS

    3310questions

    CentOSは、主にRed Hat Enterprise Linux(RHEL)をベースにした、フリーのソフトウェアオペレーティングシステムです。

CentOS7にて「openal-soft-1.16.0-3.el7.src.rpm」をインストールする際にエラーとなる

解決済

回答 1

投稿

  • 評価
  • クリップ 0
  • VIEW 1,065

yry

score 8

前提・実現したいこと

CentOS7に「openal-soft-1.16.0-3.el7.src.rpm」をインストールしようとしています。
"linux32 rpmrebuild -e openal-soft-1.16.0-3.el7.src.rpm"とコマンドを打つと下記エラーが発生します。
このエラーを解消したいです。

エラーメッセージ

/usr/lib/gcc/x86_64-redhat-linux/4.8.5/libstdc++.so when searching for
  -lstdc++

  /bin/ld: cannot find -lstdc++

  collect2: error: ld returned 1 exit status

  gmake[1]: *** [cmTryCompileExec3354063737] Error 1

  gmake[1]: Leaving directory
  `/usr/local/bin/rpmbuild/BUILD/openal-soft-1.16.0/CMakeFiles/CMakeTmp'

  gmake: *** [cmTryCompileExec3354063737/fast] Error 2





  CMake will not be able to correctly generate this project.
Call Stack (most recent call first):
  CMakeLists.txt:5 (PROJECT)


-- Configuring incomplete, errors occurred!
See also "/usr/local/bin/rpmbuild/BUILD/openal-soft-1.16.0/CMakeFiles/CMakeOutput.log".
See also "/usr/local/bin/rpmbuild/BUILD/openal-soft-1.16.0/CMakeFiles/CMakeError.log".
エラー: /var/tmp/rpm-tmp.wUwREU の不正な終了ステータス (%build)


RPM ビルドのエラー:
    /var/tmp/rpm-tmp.wUwREU の不正な終了ステータス (%build)

「/usr/local/bin/rpmbuild/BUILD/openal-soft-1.16.0/CMakeFiles/CMakeError.log」を見たのですが、
勉強不足のため理解できませんでした。。。

「CMakeError.log」の内容

Compiling the CXX compiler identification source file "CMakeCXXCompilerId.cpp" failed.
Compiler: /bin/c++ 
Build flags: -O2;-g;-pipe;-Wall;-Wp,-D_FORTIFY_SOURCE=2;-fexceptions;-fstack-protector-strong;--param=ssp-buffer-size=4;-grecord-gcc-switches;;;-m32;-
march=x86-64;-mtune=generic;-mfpmath=sse;-fasynchronous-unwind-tables
Id flags: 

The output was:
1
/bin/ld: skipping incompatible /usr/lib/gcc/x86_64-redhat-linux/4.8.5/libstdc++.so when searching for -lstdc++
/bin/ld: cannot find -lstdc++
collect2: error: ld returned 1 exit status


Determining if the CXX compiler works failed with the following output:
Change Dir: /usr/local/bin/rpmbuild/BUILD/openal-soft-1.16.0/CMakeFiles/CMakeTmp

Run Build Command:/bin/gmake "cmTryCompileExec1812208980/fast"
/bin/gmake -f CMakeFiles/cmTryCompileExec1812208980.dir/build.make CMakeFiles/cmTryCompileExec1812208980.dir/build
gmake[1]: Entering directory `/usr/local/bin/rpmbuild/BUILD/openal-soft-1.16.0/CMakeFiles/CMakeTmp'
/usr/bin/cmake -E cmake_progress_report /usr/local/bin/rpmbuild/BUILD/openal-soft-1.16.0/CMakeFiles/CMakeTmp/CMakeFiles 1
Building CXX object CMakeFiles/cmTryCompileExec1812208980.dir/testCXXCompiler.cxx.o
/bin/c++    -O2 -g -pipe -Wall -Wp,-D_FORTIFY_SOURCE=2 -fexceptions -fstack-protector-strong --param=ssp-buffer-size=4 -grecord-gcc-switches   -m32 -march=x86-64 -mtune=generic -mfpmath=sse -fasynchronous-unwind-tables     -o CMakeFiles/cmTryCompileExec1812208980.dir/testCXXCompiler.cxx.o -c /usr/local/bin/rpmbuild/BUILD/openal-soft-1.16.0/CMakeFiles/CMakeTmp/testCXXCompiler.cxx
Linking CXX executable cmTryCompileExec1812208980
/usr/bin/cmake -E cmake_link_script CMakeFiles/cmTryCompileExec1812208980.dir/link.txt --verbose=1
/bin/c++   -O2 -g -pipe -Wall -Wp,-D_FORTIFY_SOURCE=2 -fexceptions -fstack-protector-strong --param=ssp-buffer-size=4 -grecord-gcc-switches   -m32 -march=x86-64 -mtune=generic -mfpmath=sse -fasynchronous-unwind-tables     -Wl,-z,relro  CMakeFiles/cmTryCompileExec1812208980.dir/testCXXCompiler.cxx.o  -o cmTryCompileExec1812208980 -rdynamic 
/bin/ld: skipping incompatible /usr/lib/gcc/x86_64-redhat-linux/4.8.5/libstdc++.so when searching for -lstdc++
/bin/ld: cannot find -lstdc++
collect2: error: ld returned 1 exit status
gmake[1]: *** [cmTryCompileExec1812208980] Error 1
gmake[1]: Leaving directory `/usr/local/bin/rpmbuild/BUILD/openal-soft-1.16.0/CMakeFiles/CMakeTmp'
gmake: *** [cmTryCompileExec1812208980/fast] Error 2


御教授お願い致します。

  • 気になる質問をクリップする

    クリップした質問は、後からいつでもマイページで確認できます。

    またクリップした質問に回答があった際、通知やメールを受け取ることができます。

    クリップを取り消します

  • 良い質問の評価を上げる

    以下のような質問は評価を上げましょう

    • 質問内容が明確
    • 自分も答えを知りたい
    • 質問者以外のユーザにも役立つ

    評価が高い質問は、TOPページの「注目」タブのフィードに表示されやすくなります。

    質問の評価を上げたことを取り消します

  • 評価を下げられる数の上限に達しました

    評価を下げることができません

    • 1日5回まで評価を下げられます
    • 1日に1ユーザに対して2回まで評価を下げられます

    質問の評価を下げる

    teratailでは下記のような質問を「具体的に困っていることがない質問」、「サイトポリシーに違反する質問」と定義し、推奨していません。

    • プログラミングに関係のない質問
    • やってほしいことだけを記載した丸投げの質問
    • 問題・課題が含まれていない質問
    • 意図的に内容が抹消された質問
    • 広告と受け取られるような投稿

    評価が下がると、TOPページの「アクティブ」「注目」タブのフィードに表示されにくくなります。

    質問の評価を下げたことを取り消します

    この機能は開放されていません

    評価を下げる条件を満たしてません

    評価を下げる理由を選択してください

    詳細な説明はこちら

    上記に当てはまらず、質問内容が明確になっていない質問には「情報の追加・修正依頼」機能からコメントをしてください。

    質問の評価を下げる機能の利用条件

    この機能を利用するためには、以下の事項を行う必要があります。

回答 1

checkベストアンサー

0

/bin/ld: cannot find -lstdc++


これはたぶん標準C++ライブラリが見つからない、という感じだと思います。
こういう場合、まずはyum search stdc++とかしてそれっぽいパッケージを調べて試していきます。

投稿

  • 回答の評価を上げる

    以下のような回答は評価を上げましょう

    • 正しい回答
    • わかりやすい回答
    • ためになる回答

    評価が高い回答ほどページの上位に表示されます。

  • 回答の評価を下げる

    下記のような回答は推奨されていません。

    • 間違っている回答
    • 質問の回答になっていない投稿
    • スパムや攻撃的な表現を用いた投稿

    評価を下げる際はその理由を明確に伝え、適切な回答に修正してもらいましょう。

  • 2017/05/11 23:49

    ご指摘の通り、「libstdc++.i686」がインストールされていないためエラーとなっていました。
    インストール後実行するとエラーが解消されました。
    ありがとうございました。

    キャンセル

15分調べてもわからないことは、teratailで質問しよう!

  • ただいまの回答率 90.35%
  • 質問をまとめることで、思考を整理して素早く解決
  • テンプレート機能で、簡単に質問をまとめられる

同じタグがついた質問を見る

  • Linux

    4680questions

    Linuxは、Unixをベースにして開発されたオペレーティングシステムです。日本では「リナックス」と呼ばれています。 主にWebサーバやDNSサーバ、イントラネットなどのサーバ用OSとして利用されています。 上位500のスーパーコンピュータの90%以上はLinuxを使用しています。 携帯端末用のプラットフォームAndroidは、Linuxカーネル上に構築されています。

  • CentOS

    3310questions

    CentOSは、主にRed Hat Enterprise Linux(RHEL)をベースにした、フリーのソフトウェアオペレーティングシステムです。