質問をすることでしか得られない、回答やアドバイスがある。

15分調べてもわからないことは、質問しよう!

ただいまの
回答率

88.83%

carthageでエラー

受付中

回答 0

投稿

  • 評価
  • クリップ 0
  • VIEW 1,357

webappskurojp

score 31

carthageの設定中下記のエラーが出てしまいました。
以前似た現象がありSwinjectのバージョンを調整すると
解決したのですが、今回は上手く行きませんでした。

アドバイスいただけないでしょうか

try! Swiftででてきたキーワードを組み合わせたアプリを作ってみた
http://qiita.com/rizumita/items/781d3adfa63f0abc92d8
https://github.com/rizumita/GetLanguages

git clone https://github.com/rizumita/GetLanguages.git
bizp96:~/iOS/sample/GetLanguages (develop *=) $ carthage bootstrap --platform ios --no-use-binaries
*** Checking out Himotoki at "1.6.0"
*** Checking out Nimble at "v3.1.0"
*** Checking out Result at "1.0.2"
*** Checking out Quick at "v0.9.1"
*** Checking out Swiftz at "v0.4.0"
*** Checking out Swinject at "1.1.0"
*** Checking out TransitionOperator at "v0.12.0"
*** Checking out realm-cocoa at "v0.98.3"
*** Checking out APIKit at "1.2.1"
*** Checking out ReactiveCocoa at "v4.0.1"
*** Checking out Rex at "0.9.0"
*** xcodebuild output can be found in /var/folders/_4/w6txq0ds64z5rzhl40b02xcw0000gn/T/carthage-xcodebuild.SHnFjX.log
*** Building scheme "Himotoki-iOS" in Himotoki.xcodeproj
*** Building scheme "Nimble-iOS" in Nimble.xcodeproj
*** Building scheme "Quick-iOS" in Quick.xcworkspace
*** Building scheme "Result-iOS" in Result.xcodeproj
*** Building scheme "Swiftz-iOS" in Swiftz.xcodeproj
*** Building scheme "Swinject-iOS" in Swinject.xcodeproj
** BUILD FAILED **


The following build commands failed:
    PhaseScriptExecution Run\ SwiftLint /Users/bizp96/Library/Developer/Xcode/DerivedData/Swinject-bbhkksfmjfmnomafjhyemuwpmcyh/Build/Intermediates/Swinject.build/Release-iphoneos/Swinject-iOS.build/Script-98AEB3B11BE783DC0009F188.sh
(1 failure)
/Users/bizp96/myFolder/develop/project1/iOS/sample/GetLanguages/Carthage/Checkouts/Swinject/Sources/SwinjectStoryboard/Container+SwinjectStoryboard.swift:27:67: error: Variable Name Min Length Rule Violation: Variable name should be 2 characters or more: currently 1 characters (variable_name_min_length)
/Users/bizp96/myFolder/develop/project1/iOS/sample/GetLanguages/Carthage/Checkouts/Swinject/Sources/SwinjectStoryboard/Container+SwinjectStoryboard.swift:27:70: error: Variable Name Min Length Rule Violation: Variable name should be 2 characters or more: currently 1 characters (variable_name_min_length)
A shell task failed with exit code 65:
** BUILD FAILED **


The following build commands failed:
    PhaseScriptExecution Run\ SwiftLint /Users/bizp96/Library/Developer/Xcode/DerivedData/Swinject-bbhkksfmjfmnomafjhyemuwpmcyh/Build/Intermediates/Swinject.build/Release-iphoneos/Swinject-iOS.build/Script-98AEB3B11BE783DC0009F188.sh
(1 failure)
  • 気になる質問をクリップする

    クリップした質問は、後からいつでもマイページで確認できます。

    またクリップした質問に回答があった際、通知やメールを受け取ることができます。

    クリップを取り消します

  • 良い質問の評価を上げる

    以下のような質問は評価を上げましょう

    • 質問内容が明確
    • 自分も答えを知りたい
    • 質問者以外のユーザにも役立つ

    評価が高い質問は、TOPページの「注目」タブのフィードに表示されやすくなります。

    質問の評価を上げたことを取り消します

  • 評価を下げられる数の上限に達しました

    評価を下げることができません

    • 1日5回まで評価を下げられます
    • 1日に1ユーザに対して2回まで評価を下げられます

    質問の評価を下げる

    teratailでは下記のような質問を「具体的に困っていることがない質問」、「サイトポリシーに違反する質問」と定義し、推奨していません。

    • プログラミングに関係のない質問
    • やってほしいことだけを記載した丸投げの質問
    • 問題・課題が含まれていない質問
    • 意図的に内容が抹消された質問
    • 過去に投稿した質問と同じ内容の質問
    • 広告と受け取られるような投稿

    評価が下がると、TOPページの「アクティブ」「注目」タブのフィードに表示されにくくなります。

    質問の評価を下げたことを取り消します

    この機能は開放されていません

    評価を下げる条件を満たしてません

    評価を下げる理由を選択してください

    詳細な説明はこちら

    上記に当てはまらず、質問内容が明確になっていない質問には「情報の追加・修正依頼」機能からコメントをしてください。

    質問の評価を下げる機能の利用条件

    この機能を利用するためには、以下の事項を行う必要があります。

まだ回答がついていません

15分調べてもわからないことは、teratailで質問しよう!

  • ただいまの回答率 88.83%
  • 質問をまとめることで、思考を整理して素早く解決
  • テンプレート機能で、簡単に質問をまとめられる

関連した質問

同じタグがついた質問を見る