質問をすることでしか得られない、回答やアドバイスがある。

15分調べてもわからないことは、質問しよう!

ただいまの
回答率

90.52%

  • Java

    13784questions

    Javaは、1995年にサン・マイクロシステムズが開発したプログラミング言語です。表記法はC言語に似ていますが、既存のプログラミング言語の短所を踏まえていちから設計されており、最初からオブジェクト指向性を備えてデザインされています。セキュリティ面が強力であることや、ネットワーク環境での利用に向いていることが特徴です。Javaで作られたソフトウェアは基本的にいかなるプラットフォームでも作動します。

  • CentOS

    2706questions

    CentOSは、主にRed Hat Enterprise Linux(RHEL)をベースにした、フリーのソフトウェアオペレーティングシステムです。

Mavenでjava.lang.ExceptionInInitializerErrorが出る

受付中

回答 0

投稿

  • 評価
  • クリップ 0
  • VIEW 542

pandanoir

score 41

 状況

closure-gunというnpmパッケージをインストールしようとして失敗します。このパッケージはClosure CompilerというJavaプログラムをNailgunから起動するためのもののようです(Javaに疎いので正確か分かりません)。

インストールするのにgccとmavenが必要とあったので、

  • gcc 7.2.0
  • Maven 3.5.2
  • Java 9

をインストールしました。

 環境

Conohaのレンタルサーバーです。

  • CentOS 7.2 64ビット
  • Intel Xeon

ちなみにUbuntu17.10でも同じように試したところ、そちらはうまく動きました。

 問題が起きたコマンド

$ mkdir closure-gun
$ cd closure-gun
$ yarn init --yes
$ yarn add google-closure-compiler
$ yarn add closuren-gun

 エラーメッセージ

yarn add v1.3.2
[1/4] Resolving packages...
[2/4] Fetching packages...
[3/4] Linking dependencies...
[4/4] Building fresh packages...
error ~/Documents/closure-gun/node_modules/closure-gun: Command failed.
Exit code: 2
Command: make install
Arguments: 
Directory: ~/Documents/closure-gun/node_modules/closure-gun
Output:
cd "bin" && javac "NailgunTest.java" && gcc "NailgunTest.c" -shared -o libNailgunTest.so -fPIC -I/usr/java/jdk-9/include -I/usr/java/jdk-9/include/linux
mkdir "closure-compiler"
cp "../google-closure-compiler/compiler.jar" "./closure-compiler/compiler.jar"
rm -fr "tmp"; mkdir -p "tmp" "nailgun"
curl -L -o "./tmp/denji-0.9.2.tgz" "https://github.com/closure-gun/nailgun/archive/denji-0.9.2.tar.gz" \
    && tar -xf "tmp/denji-0.9.2.tgz" -C "./tmp/"
  % Total    % Received % Xferd  Average Speed   Time    Time     Time  Current
                                 Dload  Upload   Total   Spent    Left  Speed

  0     0    0     0    0     0      0      0 --:--:-- --:--:-- --:--:--     0
  0     0    0     0    0     0      0      0 --:--:-- --:--:-- --:--:--     0
100   132    0   132    0     0    189      0 --:--:-- --:--:-- --:--:--   189

 98 41721   98 41272    0     0  29511      0  0:00:01  0:00:01 --:--:-- 29511
100 41721  100 41721    0     0  29830      0  0:00:01  0:00:01 --:--:--  438k
make ng -C "./tmp/nailgun-denji-0.9.2" && mvn package --quiet -f "./tmp/nailgun-denji-0.9.2/nailgun-server/pom.xml"
make[1]: Entering directory `~/Documents/closure-gun/node_modules/closure-gun/tmp/nailgun-denji-0.9.2'
Building ng client.  To build a Windows binary, type 'make ng.exe'
cc -Wall -pedantic -s -O3 -o ng nailgun-client/ng.c
make[1]: Leaving directory `~/Documents/closure-gun/node_modules/closure-gun/tmp/nailgun-denji-0.9.2'
[WARNING] Error injecting: org.apache.maven.plugin.javadoc.JavadocJar
java.lang.ExceptionInInitializerError
    at org.apache.maven.plugin.javadoc.AbstractJavadocMojo.<clinit>(AbstractJavadocMojo.java:188)
    at java.base/jdk.internal.reflect.NativeConstructorAccessorImpl.newInstance0(Native Method)
    at java.base/jdk.internal.reflect.NativeConstructorAccessorImpl.newInstance(NativeConstructorAccessorImpl.java:62)
    at java.base/jdk.internal.reflect.DelegatingConstructorAccessorImpl.newInstance(DelegatingConstructorAccessorImpl.java:45)
    at java.base/java.lang.reflect.Constructor.newInstance(Constructor.java:488)
    at com.google.inject.internal.DefaultConstructionProxyFactory$1.newInstance(DefaultConstructionProxyFactory.java:86)
    at com.google.inject.internal.ConstructorInjector.provision(ConstructorInjector.java:105)
    at com.google.inject.internal.ConstructorInjector.access$000(ConstructorInjector.java:32)
    at com.google.inject.internal.ConstructorInjector$1.call(ConstructorInjector.java:89)
        〜
    (Teratailの文字数制限に引っかかったので中略しました)
        〜
    at org.apache.maven.DefaultMaven.execute(DefaultMaven.java:106)
    at org.apache.maven.cli.MavenCli.execute(MavenCli.java:863)
    at org.apache.maven.cli.MavenCli.doMain(MavenCli.java:288)
    at org.apache.maven.cli.MavenCli.main(MavenCli.java:199)
    at java.base/jdk.internal.reflect.NativeMethodAccessorImpl.invoke0(Native Method)
    at java.base/jdk.internal.reflect.NativeMethodAccessorImpl.invoke(NativeMethodAccessorImpl.java:62)
    at java.base/jdk.internal.reflect.DelegatingMethodAccessorImpl.invoke(DelegatingMethodAccessorImpl.java:43)
    at java.base/java.lang.reflect.Method.invoke(Method.java:564)
    at org.codehaus.plexus.classworlds.launcher.Launcher.launchEnhanced(Launcher.java:289)
    at org.codehaus.plexus.classworlds.launcher.Launcher.launch(Launcher.java:229)
    at org.codehaus.plexus.classworlds.launcher.Launcher.mainWithExitCode(Launcher.java:415)
    at org.codehaus.plexus.classworlds.launcher.Launcher.main(Launcher.java:356)
Caused by: java.lang.StringIndexOutOfBoundsException: begin 0, end 3, length 1
    at java.base/java.lang.String.checkBoundsBeginEnd(String.java:3116)
    at java.base/java.lang.String.substring(String.java:1885)
    at org.apache.commons.lang.SystemUtils.getJavaVersionAsFloat(SystemUtils.java:1133)
    at org.apache.commons.lang.SystemUtils.<clinit>(SystemUtils.java:818)
    ... 59 more
[ERROR] Failed to execute goal org.apache.maven.plugins:maven-javadoc-plugin:2.9:jar (attach-javadocs) on project nailgun-server: Execution attach-javadocs of goal org.apache.maven.plugins:maven-javadoc-plugin:2.9:jar failed: An API incompatibility was encountered while executing org.apache.maven.plugins:maven-javadoc-plugin:2.9:jar: java.lang.ExceptionInInitializerError: null
[ERROR] -----------------------------------------------------
[ERROR] realm =    plugin>org.apache.maven.plugins:maven-javadoc-plugin:2.9
[ERROR] strategy = org.codehaus.plexus.classworlds.strategy.SelfFirstStrategy
[ERROR] urls[0] = file:~/.m2/repository/org/apache/maven/plugins/maven-javadoc-plugin/2.9/maven-javadoc-plugin-2.9.jar
[ERROR] urls[1] = file:~/.m2/repository/org/slf4j/slf4j-jdk14/1.5.6/slf4j-jdk14-1.5.6.jar
[ERROR] urls[2] = file:~/.m2/repository/org/slf4j/jcl-over-slf4j/1.5.6/jcl-over-slf4j-1.5.6.jar
[ERROR] urls[3] = file:~/.m2/repository/commons-cli/commons-cli/1.2/commons-cli-1.2.jar
[ERROR] urls[4] = file:~/.m2/repository/org/codehaus/plexus/plexus-interactivity-api/1.0-alpha-4/plexus-interactivity-api-1.0-alpha-4.jar
[ERROR] urls[5] = file:~/.m2/repository/org/sonatype/plexus/plexus-sec-dispatcher/1.3/plexus-sec-dispatcher-1.3.jar
[ERROR] urls[6] = file:~/.m2/repository/org/sonatype/plexus/plexus-cipher/1.4/plexus-cipher-1.4.jar
[ERROR] urls[7] = file:~/.m2/repository/org/codehaus/plexus/plexus-interpolation/1.11/plexus-interpolation-1.11.jar
[ERROR] urls[8] = file:~/.m2/repository/backport-util-concurrent/backport-util-concurrent/3.1/backport-util-concurrent-3.1.jar
[ERROR] urls[9] = file:~/.m2/repository/org/apache/maven/reporting/maven-reporting-api/3.0/maven-reporting-api-3.0.jar
[ERROR] urls[10] = file:~/.m2/repository/org/apache/maven/maven-archiver/2.5/maven-archiver-2.5.jar
[ERROR] urls[11] = file:~/.m2/repository/org/apache/maven/shared/maven-invoker/2.0.9/maven-invoker-2.0.9.jar
[ERROR] urls[12] = file:~/.m2/repository/org/apache/maven/shared/maven-common-artifact-filters/1.3/maven-common-artifact-filters-1.3.jar
[ERROR] urls[13] = file:~/.m2/repository/org/apache/maven/doxia/doxia-sink-api/1.0/doxia-sink-api-1.0.jar
[ERROR] urls[14] = file:~/.m2/repository/org/apache/maven/doxia/doxia-site-renderer/1.0/doxia-site-renderer-1.0.jar
[ERROR] urls[15] = file:~/.m2/repository/org/apache/maven/doxia/doxia-core/1.0/doxia-core-1.0.jar
[ERROR] urls[16] = file:~/.m2/repository/org/codehaus/plexus/plexus-i18n/1.0-beta-7/plexus-i18n-1.0-beta-7.jar
[ERROR] urls[17] = file:~/.m2/repository/org/codehaus/plexus/plexus-velocity/1.1.7/plexus-velocity-1.1.7.jar
[ERROR] urls[18] = file:~/.m2/repository/org/apache/velocity/velocity/1.5/velocity-1.5.jar
[ERROR] urls[19] = file:~/.m2/repository/oro/oro/2.0.8/oro-2.0.8.jar
[ERROR] urls[20] = file:~/.m2/repository/org/apache/maven/doxia/doxia-decoration-model/1.0/doxia-decoration-model-1.0.jar
[ERROR] urls[21] = file:~/.m2/repository/commons-collections/commons-collections/3.2/commons-collections-3.2.jar
[ERROR] urls[22] = file:~/.m2/repository/org/apache/maven/doxia/doxia-module-apt/1.0/doxia-module-apt-1.0.jar
[ERROR] urls[23] = file:~/.m2/repository/org/apache/maven/doxia/doxia-module-fml/1.0/doxia-module-fml-1.0.jar
[ERROR] urls[24] = file:~/.m2/repository/org/apache/maven/doxia/doxia-module-xdoc/1.0/doxia-module-xdoc-1.0.jar
[ERROR] urls[25] = file:~/.m2/repository/org/apache/maven/doxia/doxia-module-xhtml/1.0/doxia-module-xhtml-1.0.jar
[ERROR] urls[26] = file:~/.m2/repository/commons-lang/commons-lang/2.4/commons-lang-2.4.jar
[ERROR] urls[27] = file:~/.m2/repository/commons-io/commons-io/2.2/commons-io-2.2.jar
[ERROR] urls[28] = file:~/.m2/repository/commons-httpclient/commons-httpclient/3.1/commons-httpclient-3.1.jar
[ERROR] urls[29] = file:~/.m2/repository/commons-codec/commons-codec/1.2/commons-codec-1.2.jar
[ERROR] urls[30] = file:~/.m2/repository/commons-logging/commons-logging/1.1.1/commons-logging-1.1.1.jar
[ERROR] urls[31] = file:~/.m2/repository/log4j/log4j/1.2.14/log4j-1.2.14.jar
[ERROR] urls[32] = file:~/.m2/repository/com/thoughtworks/qdox/qdox/1.12/qdox-1.12.jar
[ERROR] urls[33] = file:~/.m2/repository/junit/junit/3.8.1/junit-3.8.1.jar
[ERROR] urls[34] = file:~/.m2/repository/org/codehaus/plexus/plexus-archiver/2.1.2/plexus-archiver-2.1.2.jar
[ERROR] urls[35] = file:~/.m2/repository/org/codehaus/plexus/plexus-io/2.0.4/plexus-io-2.0.4.jar
[ERROR] urls[36] = file:~/.m2/repository/org/codehaus/plexus/plexus-utils/3.0.5/plexus-utils-3.0.5.jar
[ERROR] Number of foreign imports: 1
[ERROR] import: Entry[import  from realm ClassRealm[maven.api, parent: null]]
[ERROR] 
[ERROR] -----------------------------------------------------: begin 0, end 3, length 1
[ERROR] -> [Help 1]
[ERROR] 
[ERROR] To see the full stack trace of the errors, re-run Maven with the -e switch.
[ERROR] Re-run Maven using the -X switch to enable full debug logging.
[ERROR] 
[ERROR] For more information about the errors and possible solutions, please read the following articles:
[ERROR] [Help 1] http://cwiki.apache.org/confluence/display/MAVEN/PluginContainerException
make: *** [nailgun] Error 1
info Visit https://yarnpkg.com/en/docs/cli/add for documentation about this command.
  • 気になる質問をクリップする

    クリップした質問は、後からいつでもマイページで確認できます。

    またクリップした質問に回答があった際、通知やメールを受け取ることができます。

    クリップを取り消します

  • 良い質問の評価を上げる

    以下のような質問は評価を上げましょう

    • 質問内容が明確
    • 自分も答えを知りたい
    • 質問者以外のユーザにも役立つ

    評価が高い質問は、TOPページの「注目」タブのフィードに表示されやすくなります。

    質問の評価を上げたことを取り消します

  • 評価を下げられる数の上限に達しました

    評価を下げることができません

    • 1日5回まで評価を下げられます
    • 1日に1ユーザに対して2回まで評価を下げられます

    質問の評価を下げる

    teratailでは下記のような質問を「具体的に困っていることがない質問」、「サイトポリシーに違反する質問」と定義し、推奨していません。

    • プログラミングに関係のない質問
    • やってほしいことだけを記載した丸投げの質問
    • 問題・課題が含まれていない質問
    • 意図的に内容が抹消された質問
    • 広告と受け取られるような投稿

    評価が下がると、TOPページの「アクティブ」「注目」タブのフィードに表示されにくくなります。

    質問の評価を下げたことを取り消します

    この機能は開放されていません

    評価を下げる条件を満たしてません

    評価を下げる理由を選択してください

    詳細な説明はこちら

    上記に当てはまらず、質問内容が明確になっていない質問には「情報の追加・修正依頼」機能からコメントをしてください。

    質問の評価を下げる機能の利用条件

    この機能を利用するためには、以下の事項を行う必要があります。

まだ回答がついていません

15分調べてもわからないことは、teratailで質問しよう!

  • ただいまの回答率 90.52%
  • 質問をまとめることで、思考を整理して素早く解決
  • テンプレート機能で、簡単に質問をまとめられる

関連した質問

同じタグがついた質問を見る

  • Java

    13784questions

    Javaは、1995年にサン・マイクロシステムズが開発したプログラミング言語です。表記法はC言語に似ていますが、既存のプログラミング言語の短所を踏まえていちから設計されており、最初からオブジェクト指向性を備えてデザインされています。セキュリティ面が強力であることや、ネットワーク環境での利用に向いていることが特徴です。Javaで作られたソフトウェアは基本的にいかなるプラットフォームでも作動します。

  • CentOS

    2706questions

    CentOSは、主にRed Hat Enterprise Linux(RHEL)をベースにした、フリーのソフトウェアオペレーティングシステムです。